Uploaded image for project: 'JDK'
  1. JDK
  2. JDK-4205661

Regression test ModalDialogTest.html Failing

    XMLWordPrintable

    Details

    • Subcomponent:
    • Resolved In Build:
      1.1.8
    • CPU:
      generic
    • OS:
      solaris_2.5.1
    • Verification:
      Not verified

      Description

      Regression test ModalDialogTest.html Failing. Test needs to be updated, doesn;t have pass fail buttons yet requires user interaction. Here is the results file:

      #Test Results
      #Wed Jan 20 13:32:40 PST 1999
      testsuite=X:\\regress118\\test
      source=ModalDialogTest.html
      title=Modal dialogs don't act modal if addNotify() is called before setModal(true).
      status=Failed. Execution failed: Applet thread threw exception: java.lang.RuntimeException: Test FAILED
      work=F:\\REGRESSION\\results\\DAYSTROM-Windows_NT-harness118f-testwith118f-01-20-13.29\\java\\awt\\Dialog\\DialogModalityTest
      author=###@###.### area=
      execStatus=Failed. Execution failed: Applet thread threw exception: java.lang.RuntimeException: Test FAILED
      description=file:X:/regress118/test/java/awt/Dialog/DialogModalityTest/ModalDialogTest.html
      javatestVersion=JT_2.0_zn
      sections=compile compile applet applet
      file=X:\\regress118\\test\\java\\awt\\Dialog\\DialogModalityTest\\ModalDialogTest.html
      end=Wed Jan 20 13:32:40 PST 1999
      bug=4078176
      run=1 applet ModalDialogTest.html\r\n
      start=Wed Jan 20 13:32:30 PST 1999
      keywords=4078176
      environment=regtest

      test: java\awt\Dialog\DialogModalityTest\ModalDialogTest.html
      script: javasoft.sqe.javatest.regtest.RegressionScript
      JDK under test: java full version "JDK1.1.8F" (D:/jdk118f)
      command: build ModalDialogTest
      reason: Named class compiled on demand
      command: compile X:\regress118\test\java\awt\Dialog\DialogModalityTest\ModalDialogTest.java
      reason: .class file out of date or does not exist
      ----------ref:compile(0/0)----------
      ----------log:compile(2/167)----------
      Note: X:\\regress118\\test\\java\\awt\\Dialog\\DialogModalityTest\\ModalDialogTest.java uses a deprecated API. Recompile with "-deprecation" for details.
      1 warning
      command: compile result: Passed. Compilation successful
      command: build result: Passed. Compilation successful
      command: applet ModalDialogTest.html
      reason: User specified action: run applet ModalDialogTest.html
      ----------ref:applet(0/0)----------
      ----------log:applet(6/410)----------
      java.lang.RuntimeException: Test FAILED
      at ModalDialogTest.start(ModalDialogTest.java:74)
      at javasoft.sqe.javatest.regtest.AppletWrapper$AppletRunner.appletStart(AppletWrapper.java:308)
      at javasoft.sqe.javatest.regtest.AppletWrapper$AppletThread.run(AppletWrapper.java:139)
      at java.lang.Thread.run(Thread.java:466)
      STATUS:Failed.Applet thread threw exception: java.lang.RuntimeException: Test FAILED
      command: applet result: Failed. Execution failed: Applet thread threw exception: java.lang.RuntimeException: Test FAILED
      test result: Failed. Execution failed: Applet thread threw exception: java.lang.RuntimeException: Test FAILED

        Attachments

          Activity

            People

            Assignee:
            tdv Dmitri Trembovetski (Inactive)
            Reporter:
            joleesunw John Lee (Inactive)
            Votes:
            0 Vote for this issue
            Watchers:
            1 Start watching this issue

              Dates

              Created:
              Updated:
              Resolved:
              Imported:
              Indexed: