Uploaded image for project: 'JDK'
  1. JDK
  2. JDK-4352715

jck_regr: api/java_awt/java2d/image/AffineTransformOp/index.html#FilterTest1

    XMLWordPrintable

    Details

    • Type: Bug
    • Status: Closed
    • Priority: P2
    • Resolution: Duplicate
    • Affects Version/s: 1.4.0
    • Fix Version/s: None
    • Component/s: client-libs
    • Labels:
      None
    • Subcomponent:
      2d
    • CPU:
      generic
    • OS:
      generic

      Description

      al.smith@eng 2000-07-12
      =======================
       
      Please run the following script to reproduce the failure:
      /net/sqesvr.eng/export/st3/jdk1.4/bugs/<thisbugid>/runit.sh

      Test case can be found in:
      /net/sqesvr/export/st1/JCK-13/tests/api/java_awt/java2d/image/AffineTransformOp/
      JDK version: Merlin B20
      JCK version: JCK13

      Test:
      javasoft.sqe.javatest.lib.ExecJCKTestOtherJVMCmd CLASSPATH=Z:\\st1\\JCK-13\\tests/../classes;Z:\\st1\\JCK-13\\javatest.jar PATH=Z:\\st1\\JCK-13\\tests\\..\\lib\\win32; windir=c:\\windows c:\\jdk14\\bin\\java -Xfuture -Djava.security.policy=policy.txt javasoft.sqe.tests.api.java.awt.java2d.image.AffineTransformOp.FilterTest1

      Output from the jtr file:
      =========================
      #Test Results (version 2)
      #Mon Jun 26 06:41:55 PDT 2000
      #checksum:5bbd136652422d16
      #-----testdescription-----
      $file=Z:\\st1\\JCK-13\\tests\\api\\java_awt\\java2d\\image\\AffineTransformOp\\index.html
      $root=Z:\\st1\\JCK-13\\tests
      executeClass=javasoft.sqe.tests.api.java.awt.java2d.image.AffineTransformOp.FilterTest1
      id=FilterTest1
      keywords=positive runtime
      source=FilterTest1.java
      title=AffineTransformOp.filter(BufferedImage,BufferedImage)

      #-----environment-----
      EXECUTE_CLASSPATH=$testSuiteRootDir/../classes$:$javatestClassDir
      EXECUTE_FLAGS=
      EXECUTE_JAVA=c:\\jdk14\\bin\\java
      EXE_PATH=${LDLIBPATH};$PATH
      EXE_SYSTEMROOT=c:\\windows
      ExecJCKTestOtherJVMCmd=javasoft.sqe.javatest.lib.ExecJCKTestOtherJVMCmd
      LDLIBPATH=$testSuiteRootDir\\..\\lib\\win32
      command.testExecute=$ExecJCKTestOtherJVMCmd CLASSPATH=${EXECUTE_CLASSPATH} PATH=${EXE_PATH} windir=${EXE_SYSTEMROOT} ${EXECUTE_JAVA} ${EXECUTE_FLAGS} -Xfuture -Djava.security.policy=policy.txt $testExecuteClass $testExecuteArgs

      #-----testresult-----
      description=file:Z:/st1/JCK-13/tests/api/java_awt/java2d/image/AffineTransformOp/index.html#FilterTest1
      end=Mon Jun 26 06:41:55 PDT 2000
      environment=jck-runtime-win95
      execStatus=Failed. tests: 6; passed: 4; failed: 2; first test case failure: 0:0:0
      javatestOS=Windows 98 4.10 (x86)
      javatestVersion=JT_2.1.2j
      script=javasoft.sqe.javatest.lib.JCKScript -runtime
      sections=script_messages testExecute
      start=Mon Jun 26 06:41:54 PDT 2000
      status=Failed. tests: 6; passed: 4; failed: 2; first test case failure: 0:0:0
      test=api/java_awt/java2d/image/AffineTransformOp/index.html#FilterTest1
      timeoutSeconds=600
      work=C:\\mandalay-jck13-jdk14-xint\\api\\java_awt\\java2d\\image\\AffineTransformOp

      #section:script_messages
      ----------messages:(1/25)----------
      Executing test class...

      #section:testExecute
      ----------messages:(1/336)*----------
      command: javasoft.sqe.javatest.lib.ExecJCKTestOtherJVMCmd CLASSPATH=Z:\\st1\\JCK-13\\tests/../classes;Z:\\st1\\JCK-13\\javatest.jar PATH=Z:\\st1\\JCK-13\\tests\\..\\lib\\win32; windir=c:\\windows c:\\jdk14\\bin\\java -Xfuture -Djava.security.policy=policy.txt javasoft.sqe.tests.api.java.awt.java2d.image.AffineTransformOp.FilterTest1
      ----------ref:(22/1477)----------
      ----------------------------------------------------------------
                     AssertionTest Report
      ----------------------------------------------------------------
       Method Name : public final java.awt.image.BufferedImage java.awt.image.AffineTransformOp.filter(java.awt.image.BufferedImage,java.awt.image.BufferedImage)
       Class Name : class java.awt.image.AffineTransformOp
      ----------------------------------------------------------------
      --------------------------------------------------------------
       Index of factory objects : 0:0:0
       Test Status : Unexpected Exception: java.awt.image.ImagingOpException: Unable to transform src image raised
      --------------------------------------------------------------
      --------------------------------------------------------------
       Index of factory objects : 0:0:1
       Test Status : Unexpected Exception: java.awt.image.ImagingOpException: Unable to transform src image raised
      --------------------------------------------------------------
      --------------------------------------------------------------------
                     Overall AssertionTest Result Summary
      --------------------------------------------------------------------
       Overall Test Status : Failed
       Total Number of Tests : 6
       Total Tests Passed : 4
       Total Tests Failed : 2
      --------------------------------------------------------------------
      ----------log:(1/78)----------
      STATUS:Failed.tests: 6; passed: 4; failed: 2; first test case failure: 0:0:0
      result: Failed. tests: 6; passed: 4; failed: 2; first test case failure: 0:0:0


      test result: Failed. tests: 6; passed: 4; failed: 2; first test case failure: 0:0:0

        Attachments

          Issue Links

            Activity

              People

              Assignee:
              Unassigned Unassigned
              Reporter:
              apsmith Alan Smith (Inactive)
              Votes:
              0 Vote for this issue
              Watchers:
              1 Start watching this issue

                Dates

                Created:
                Updated:
                Resolved:
                Imported:
                Indexed: