Uploaded image for project: 'JDK'
  1. JDK
  2. JDK-4391993

Regression test: java/text/resources/EuroResource.java is failing

    XMLWordPrintable

    Details

      Description

      Regression test: java/text/resources/EuroResouce.java failed with jdk1.4.0beta b40 on RedHat Linux 6.2 in de_DE locale

      Below is a part of the message:

      #section:compile
      ----------messages:(3/172)----------
      command: compile /export/home/tester/regression/test/java/text/resources/EuroResource.java
      reason: .class file out of date or does not exist
      elapsed time (seconds): 1.852
      ----------System.out:(0/0)----------
      ----------System.err:(0/0)----------
      result: Passed. Compilation successful

      #section:main
      ----------messages:(3/123)----------
      command: main EuroResource
      reason: Assumed action based on file name: run main EuroResource
      elapsed time (seconds): 1.759
      ----------System.out:(1/11)----------
      ca_ES_EURO
      ----------System.err:(13/918)----------
      java.util.MissingResourceException: Can't find bundle for base name java.text.resources.LocaleElements, locale ca_ES_EURO
              at java.util.ResourceBundle.throwMissingResourceException(ResourceBundle.java:800)
              at java.util.ResourceBundle.getBundleImpl(ResourceBundle.java:770)
              at java.util.ResourceBundle.getBundle(ResourceBundle.java:541)
              at EuroResource.main(EuroResource.java:29)
              at java.lang.reflect.Method.invoke(Native Method)
              at javasoft.sqe.javatest.regtest.MainWrapper$MainThread.run(MainWrapper.java:94)
              at java.lang.Thread.run(Thread.java:565)

      JavaTest Message: Test threw exception: java.util.MissingResourceException: Can't find bundle for base name java.text.resources.LocaleElements, locale ca_ES_EURO
      JavaTest Message: shutting down test

      STATUS:Failed.`main' threw exception: java.util.MissingResourceException: Can't find bundle for base name java.text.resources.LocaleElements, locale ca_ES_EURO
      result: Failed. Execution failed: `main' threw exception: java.util.MissingResourceException: Can't find bundle for base name java.text.resources.LocaleElements, locale ca_ES_EURO


      test result: Failed. Execution failed: `main' threw exception: java.util.MissingResourceException: Can't find bundle for base name java.text.resources.LocaleElements, locale ca_ES_EURO


      The test failed on Win200 in ko enabled, too




      keiko.nakayama@Eng 2000-11-22

        Attachments

          Activity

            People

            Assignee:
            nlindenbsunw Norbert Lindenberg (Inactive)
            Reporter:
            knakayamsunw Keiko Nakayama (Inactive)
            Votes:
            0 Vote for this issue
            Watchers:
            0 Start watching this issue

              Dates

              Created:
              Updated:
              Resolved:
              Imported:
              Indexed: