Uploaded image for project: 'JDK'
  1. JDK
  2. JDK-4396691

Regression test:/java/util/Locale/LocaleDataTest.java failing

    Details

    • Type: Bug
    • Status: Closed
    • Priority: P3
    • Resolution: Duplicate
    • Affects Version/s: 1.4.0
    • Fix Version/s: None
    • Component/s: core-libs

      Description

      Regression test:/java/util/Locale/LocaleDataTest.java failed with jdk1.4 beta b44 on Solaris Sparc 2.7 in ar locale.

      Below is a part of the message:


      ----------System.out:(13/474)*----------
      Mismatch in LocaleElements/ru_RU/Languages/ru:
        file = "\\u0440\\u0443\\u0441\\u0441\\u043a\\u0438\\u0439"
         jvm = "\\u0420\\u0443\\u0441\\u0441\\u043a\\u0438\\u0439"
      Mismatch in LocaleElements/fr_FR/Languages/nl:
        file = "hollandais"
         jvm = "n\\u00e9erlandais"
      Mismatch in LocaleElements/fr_FR/Countries/US:
        file = "\\u00c9tats-Unis"
         jvm = "Etats-Unis"
      Mismatch in LocaleElements/fr_FR/Countries/NL:
        file = "Pays-Bas"
         jvm = "Pay-Bas"
      Test failed. 4 errors.
      ----------System.err:(10/476)----------
      java.lang.Exception: Test failed. 4 errors.
              at LocaleDataTest.main(LocaleDataTest.java:158)
              at java.lang.reflect.Method.invoke(Native Method)
              at javasoft.sqe.javatest.regtest.MainWrapper$MainThread.run(MainWrapper.java:94)
              at java.lang.Thread.run(Thread.java:565)

      JavaTest Message: Test threw exception: java.lang.Exception: Test failed. 4 errors.
      JavaTest Message: shutting down test

      STATUS:Failed.`main' threw exception: java.lang.Exception: Test failed. 4 errors.
      result: Failed. Execution failed: `main' threw exception: java.lang.Exception: Test failed. 4 errors.



      keiko.nakayama@Eng 2000-12-08

        Attachments

          Issue Links

            Activity

              People

              • Assignee:
                nlindenbsunw Norbert Lindenberg (Inactive)
                Reporter:
                knakayamsunw Keiko Nakayama (Inactive)
              • Votes:
                0 Vote for this issue
                Watchers:
                0 Start watching this issue

                Dates

                • Created:
                  Updated:
                  Resolved:
                  Imported:
                  Indexed: