Uploaded image for project: 'JDK'
  1. JDK
  2. JDK-4401580

Regression test:java/text/Collator/G7Test.java failing

    XMLWordPrintable

    Details

    • Subcomponent:
    • CPU:
      x86, sparc
    • OS:
      solaris_8

      Description

             at javasoft.sqe.javatest.regtest.MainWrapper$MainThread.run(MainWrapper.java:94)
              at java.lang.Thread.run(Thread.java:565)
          Uncaught exception thrown in test method TestDemoTest2
      ----------System.err:(15/603)----------
      java.lang.RuntimeException: Uncaught exception thrown in test method TestDemoTest2

              at CollatorTest.err(CollatorTest.java:212)
              at CollatorTest.errln(CollatorTest.java:217)
              at CollatorTest.run(CollatorTest.java:166)
              at G7Test.main(G7Test.java:38)
              at java.lang.reflect.Method.invoke(Native Method)
              at javasoft.sqe.javatest.regtest.MainWrapper$MainThread.run(MainWrapper.java:94)
              at java.lang.Thread.run(Thread.java:565)

      JavaTest Message: Test threw exception: java.lang.RuntimeException: Uncaught exception thrown in test method TestDemoTest2

      JavaTest Message: shutting down test

      STATUS:Failed.
      result: Failed. Execution failed




      keiko.nakayama@Eng 2001-01-03
      Regression test: java/text/Collator/G7Test.java failed with jdk1.4 beta b45 and b46 on Solaris Sparc 8 in iw_IL locale and c locale, and win2000 in ko enabled locale.

      Below is a part of the message:


      ----------messages:(3/111)----------
      command: main G7Test
      reason: Assumed action based on file name: run main G7Test
      elapsed time (seconds): 2.997
      ----------System.out:(414/9281)----------
      G7Test {
        TestDemoTest2+++ trying
      +++ created RuleBasedCollator()
                      completed test - 0
                      completed test - 0
                      completed test - 0
                      completed test - 0
                      completed test - 0
                      completed test - 0
                      completed test - 0
                      completed test - 0
                      completed test - 0
                      completed test - 0
                      completed test - 0
                      completed test - 0
                      completed test - 0
                      completed test - 0
                      completed test - 0
                      completed test - 0
                      completed test - 0
                      completed test - 0
                      completed test - 0
                      completed test - 0
                      completed test - 0
                      completed test - 0
                      completed test - 0
                      completed test - 0
                      completed test - 0
                      completed test - 0
                      completed test - 0
                      completed test - 0
                      completed test - 0
                      completed test - 1
                      completed test - 1
                      completed test - 1
                      completed test - 1
                      completed test - 1
                      completed test - 1
                      completed test - 1
                      completed test - 1
                      completed test - 1
                      completed test - 1
                      completed test - 1
                      completed test - 1
                      completed test - 1
                      completed test - 1
                      completed test - 1
                      completed test - 1
                      completed test - 1
                      completed test - 1
                      completed test - 1
                      completed test - 1
                      completed test - 1
                      completed test - 1
                      completed test - 1
                      completed test - 1
                      completed test - 1
                      completed test - 1
                      completed test - 1
                      completed test - 1
                      completed test - 2
                      completed test - 2
                      completed test - 2
                      completed test - 2
                      completed test - 2
                      completed test - 2
                      completed test - 2
                      completed test - 2
                      completed test - 2
                      completed test - 2
                      completed test - 2
                      completed test - 2
                      completed test - 2
                      completed test - 2
                      completed test - 2
                      completed test - 2
                      completed test - 2
                      completed test - 2
                      completed test - 2
                      completed test - 2
                      completed test - 2
                      completed test - 2
                      completed test - 2
                      completed test - 2
                      completed test - 2
                      completed test - 2
                      completed test - 2
                      completed test - 3
                      completed test - 3
                      completed test - 3
                      completed test - 3
                      completed test - 3
                      completed test - 3
                      completed test - 3
                      completed test - 3
                      completed test - 3
                      completed test - 3
                      completed test - 3
                      completed test - 3
                      completed test - 3
                      completed test - 3
                      completed test - 3
                      completed test - 3
                      completed test - 3
                      completed test - 3
                      completed test - 3
                      completed test - 3
                      completed test - 3
                      completed test - 3
                      completed test - 3
                      completed test - 3
                      completed test - 3
                      completed test - 3
                      completed test - 4
                      completed test - 4
                      completed test - 4
                      completed test - 4
                      completed test - 4
                      completed test - 4
                      completed test - 4
                      completed test - 4
                      completed test - 4
                      completed test - 4
                      completed test - 4
                      completed test - 4
                      completed test - 4
                      completed test - 4
                      completed test - 4
                      completed test - 4
                      completed test - 4
                      completed test - 4
                      completed test - 4
                      completed test - 4
                      completed test - 4
                      completed test - 4
                      completed test - 4
                      completed test - 4
                      completed test - 4
                      completed test - 5
                      completed test - 5
                      completed test - 5
                      completed test - 5
                      completed test - 5
                      completed test - 5
                      completed test - 5
                      completed test - 5
                      completed test - 5
                      completed test - 5
                      completed test - 5
                      completed test - 5
                      completed test - 5
                      completed test - 5
                      completed test - 5
                      completed test - 5
                      completed test - 5
                      completed test - 5
                      completed test - 5
                      completed test - 5
                      completed test - 5
                      completed test - 5
                      completed test - 5
                      completed test - 5
                      completed test - 6
                      completed test - 6
                      completed test - 6
                      completed test - 6
                      completed test - 6
                      completed test - 6
                      completed test - 6
                      completed test - 6
                      completed test - 6
                      completed test - 6
                      completed test - 6
                      completed test - 6
                      completed test - 6
                      completed test - 6
                      completed test - 6
                      completed test - 6
                      completed test - 6
                      completed test - 6
                      completed test - 6
                      completed test - 6
                      completed test - 6
                      completed test - 6
                      completed test - 6
                      completed test - 7
                      completed test - 7
                      completed test - 7
                      completed test - 7
                      completed test - 7
                      completed test - 7
                      completed test - 7
                      completed test - 7
                      completed test - 7
                      completed test - 7
                      completed test - 7
                      completed test - 7
                      completed test - 7
                      completed test - 7
                      completed test - 7
                      completed test - 7
                      completed test - 7
                      completed test - 7
                      completed test - 7
                      completed test - 7
                      completed test - 7
                      completed test - 7
                      completed test - 8
                      completed test - 8
                      completed test - 8
                      completed test - 8
                      completed test - 8
                      completed test - 8
                      completed test - 8
                      completed test - 8
                      completed test - 8
                      completed test - 8
                      completed test - 8
                      completed test - 8
                      completed test - 8
                      completed test - 8
                      completed test - 8
                      completed test - 8
                      completed test - 8
                      completed test - 8
                      completed test - 8
                      completed test - 8
                      completed test - 8
                      completed test - 9
                      completed test - 9
                      completed test - 9
                      completed test - 9
                      completed test - 9
                      completed test - 9
                      completed test - 9
                      completed test - 9
                      completed test - 9
                      completed test - 9
                      completed test - 9
                      completed test - 9
                      completed test - 9
                      completed test - 9
                      completed test - 9
                      completed test - 9
                      completed test - 9
                      completed test - 9
                      completed test - 9
                      completed test - 9
                      completed test - 10
                      completed test - 10
                      completed test - 10
                      completed test - 10
                      completed test - 10
                      completed test - 10
                      completed test - 10
                      completed test - 10
                      completed test - 10
                      completed test - 10
                      completed test - 10
                      completed test - 10
                      completed test - 10
                      completed test - 10
                      completed test - 10
                      completed test - 10
                      completed test - 10
                      completed test - 10
                      completed test - 10
                      completed test - 11
                      completed test - 11
                      completed test - 11
                      completed test - 11
                      completed test - 11
                      completed test - 11
                      completed test - 11
                      completed test - 11
                      completed test - 11
                      completed test - 11
                      completed test - 11
                      completed test - 11
                      completed test - 11
                      completed test - 11
                      completed test - 11
                      completed test - 11
                      completed test - 11
                      completed test - 11
                      completed test - 12
                      completed test - 12
                      completed test - 12
                      completed test - 12
                      completed test - 12
                      completed test - 12
                      completed test - 12
                      completed test - 12
                      completed test - 12
                      completed test - 12
                      completed test - 12
                      completed test - 12
                      completed test - 12
                      completed test - 12
                      completed test - 12
                      completed test - 12
                      completed test - 12
                      completed test - 13
                      completed test - 13
                      completed test - 13
                      completed test - 13
                      completed test - 13
                      completed test - 13
                      completed test - 13
                      completed test - 13
                      completed test - 13
                      completed test - 13
                      completed test - 13
                      completed test - 13
                      completed test - 13
                      completed test - 13
                      completed test - 13
                      completed test - 13
                      completed test - 14
                      completed test - 14
                      completed test - 14
                      completed test - 14
                      completed test - 14
                      completed test - 14
                      completed test - 14
                      completed test - 14
                      completed test - 14
                      completed test - 14
                      completed test - 14
                      completed test - 14
                      completed test - 14
                      completed test - 14
                      completed test - 14
                      completed test - 15
                      completed test - 15
                      completed test - 15
                      completed test - 15
                      completed test - 15
                      completed test - 15
                      completed test - 15
                      completed test - 15
                      completed test - 15
                      completed test - 15
                      completed test - 15
                      completed test - 15
                      completed test - 15
                      completed test - 15
                      completed test - 16
                      completed test - 16
                      completed test - 16
                      completed test - 16
                      completed test - 16
                      completed test - 16
                      completed test - 16
                      completed test - 16
                      completed test - 16
                      completed test - 16
                      completed test - 16
                      completed test - 16
                      completed test - 16
                      completed test - 17
                      completed test - 17
                      completed test - 17
                      completed test - 17
                      completed test - 17
                      completed test - 17
                      completed test - 17
                      completed test - 17
                      completed test - 17
                      completed test - 17
                      completed test - 17
                      completed test - 17
                      completed test - 18
                      completed test - 18
                      completed test - 18
                      completed test - 18
                      completed test - 18
                      completed test - 18
                      completed test - 18
                      completed test - 18
                      completed test - 18
                      completed test - 18
                      completed test - 18
                      completed test - 19
                      completed test - 19
                      completed test - 19
                      completed test - 19
                      completed test - 19
                      completed test - 19
                      completed test - 19
                      completed test - 19
                      completed test - 19
                      completed test - 19
       {
          Collation Test failed! Source = p?ch? Target = p?che result should be <
          Exception: Collation Test failed! Source = p?ch? Target = p?che result should be <

      Demo Test 2 Table Collation object creation failed.

      java.lang.RuntimeException: Exception: Collation Test failed! Source = p?ch? Target = p?che result should be <

      Demo Test 2 Table Collation object creation failed.


              at CollatorTest.err(CollatorTest.java:212)
              at CollatorTest.errln(CollatorTest.java:217)
              at G7Test.TestDemoTest2(G7Test.java:176)
              at java.lang.reflect.Method.invoke(Native Method)
              at CollatorTest.run(CollatorTest.java:159)
              at G7Test.main(G7Test.java:38)
              at java.lang.reflect.Method.invoke(Native Method)
       

        Attachments

          Issue Links

            Activity

              People

              Assignee:
              joconnersunw John Oconner (Inactive)
              Reporter:
              knakayamsunw Keiko Nakayama (Inactive)
              Votes:
              0 Vote for this issue
              Watchers:
              0 Start watching this issue

                Dates

                Created:
                Updated:
                Resolved:
                Imported:
                Indexed: