Uploaded image for project: 'JDK'
  1. JDK
  2. JDK-4424741

Regression test:sun/io/Converter/EuroConverter.java failing

    XMLWordPrintable

    Details

    • Subcomponent:
    • CPU:
      x86
    • OS:
      windows_nt

      Description

      Regression test: sun/io/Converter/EuroConverter.java failed against jdk1.4.0beta b55 on Win98SE de locale and IA8 ko. UTF8 as well as solaris sparc 8 en(C) locale.

      Below is a part of a message:

      ----------messages:(3/127)----------
      command: main EuroConverter
      reason: Assumed action based on file name: run main EuroConverter
      elapsed time (seconds): 0.77
      ----------System.out:(13/518)----------
      Checking encoder ISO8859_15_FDIS against ISO8859_1
      Checking encoder Cp923 against ISO8859_15_FDIS
      Checking encoder Cp858 against Cp850
      Checking encoder Cp1140 against Cp037
      Unsupported encoding Cp1140
      Checking encoder Cp1142 against Cp277
      Checking encoder Cp1143 against Cp278
      Checking encoder Cp1144 against Cp280
      Checking encoder Cp1145 against Cp284
      Checking encoder Cp1146 against Cp285
      Checking encoder Cp1147 against Cp297
      Checking encoder Cp1148 against Cp500
      Checking encoder Cp1149 against Cp871
      ----------System.err:(13/946)----------
      java.lang.RuntimeException: Bug 4114080 - Euro encoder test failed
              at EuroConverter.main(EuroConverter.java:104)
              at sun.reflect.NativeMethodAccessorImpl.invoke0(Native Method)
              at sun.reflect.NativeMethodAccessorImpl.invoke(../../../src/share/classes/sun/reflect/NativeMethodAccessorImpl.java:30)
              at sun.reflect.InflatableMethodAccessorImpl.invoke(../../../src/share/classes/sun/reflect/InflatableMethodAccessorImpl.java:46)
              at java.lang.reflect.Method.invoke(../../../src/share/classes/java/lang/reflect/Method.java:306)
              at com.sun.javatest.regtest.MainWrapper$MainThread.run(MainWrapper.java:94)
              at java.lang.Thread.run(../../../src/share/classes/java/lang/Thread.java:579)

      JavaTest Message: Test threw exception: java.lang.RuntimeException: Bug 4114080 - Euro encoder test failed
      JavaTest Message: shutting down test

      STATUS:Failed.`main' threw exception: java.lang.RuntimeException: Bug 4114080 - Euro encoder test failed




      keiko.nakayama@Eng 2001-03-12

        Attachments

          Issue Links

            Activity

              People

              Assignee:
              ilittlesunw Ian Little (Inactive)
              Reporter:
              knakayamsunw Keiko Nakayama (Inactive)
              Votes:
              0 Vote for this issue
              Watchers:
              0 Start watching this issue

                Dates

                Created:
                Updated:
                Resolved:
                Imported:
                Indexed: