Uploaded image for project: 'JDK'
  1. JDK
  2. JDK-4430434

Regression Testing:G7Tes.java:java.lang.RuntimeException: Exception: Collation T

    Details

    • Subcomponent:
    • CPU:
      x86
    • OS:
      solaris_8

      Description



      Name: jbT81659 Date: 03/27/2001

      Os:Solaris(5.8)-Intel
      JDK:1.4.0-B56
      Test failed and JTREG generated the following report:
      ====================================================
      #Test Results (version 2)
      #Sun Mar 25 12:21:39 IST 2001
      #checksum:6e924d68dd9a08b4
      #-----testdescription-----
      $file=/home-bazelet/isam/jtreg/test/java/text/Collator/G7Test.java
      $root=/home-bazelet/isam/jtreg/test
      run=ASSUMED_ACTION main G7Test\n
      source=G7Test.java
      title=test G7 Collation

      #-----environment-----

      #-----testresult-----
      description=file:///home-bazelet/isam/jtreg/test/java/text/Collator/G7Test.java
      end=Sun Mar 25 12:21:39 IST 2001
      environment=regtest
      execStatus=Failed. Execution failed
      javatestOS=SunOS 5.8 (x86)
      javatestVersion=JT_2.1.4b05
      script=com.sun.javatest.regtest.RegressionScript
      sections=script_messages build main
      start=Sun Mar 25 12:21:34 IST 2001
      status=Failed. Execution failed
      test=java/text/Collator/G7Test.java
      work=/home-bazelet/isam/jtreg/JTwork/java/text/Collator

      #section:script_messages
      ----------messages:(1/83)----------
      JDK under test: java full version "1.4.0-beta-b56" (/home/sun/builds/jdk/solarisX)

      #section:build
      ----------messages:(3/91)----------
      command: build G7Test
      reason: Named class compiled on demand
      elapsed time (seconds): 0.02
      result: Passed. No need to compile: G7Test.java

      #section:main
      ----------messages:(3/111)----------
      command: main G7Test
      reason: Assumed action based on file name: run main G7Test
      elapsed time (seconds): 5.177
      ----------System.out:(420/9752)----------
      G7Test {
        TestDemoTest2+++ trying
      +++ created RuleBasedCollator()
                      completed test - 0
                      completed test - 0
                      completed test - 0
                      completed test - 0
                      completed test - 0
                      completed test - 0
                      completed test - 0
                      completed test - 0
                      completed test - 0
                      completed test - 0
                      completed test - 0
                      completed test - 0
                      completed test - 0
                      completed test - 0
                      completed test - 0

                      completed test - 0
                      completed test - 0
                      completed test - 0
                      completed test - 0
                      completed test - 0
                      completed test - 0
                      completed test - 0
                      completed test - 0
                      completed test - 0
                      completed test - 0
                      completed test - 1
                      completed test - 1
                      completed test - 1
                      completed test - 1
                      completed test - 1
                      completed test - 1
                      completed test - 1
                      completed test - 1
                      completed test - 1
                      completed test - 1
                      completed test - 1
                      completed test - 1
                      completed test - 1
                      completed test - 1
                      completed test - 1
                      completed test - 1
                      completed test - 1
                      completed test - 1
                      completed test - 1
                      completed test - 1
                      completed test - 1
                      completed test - 1
                      completed test - 1
                     completed test - 1
                      completed test - 1
                      completed test - 1
                      completed test - 1
                      completed test - 1
                      completed test - 1
                      completed test - 2
                      completed test - 2
                      completed test - 2
                      completed test - 2
                      completed test - 2
                      completed test - 2
                      completed test - 2
                      completed test - 2
                      completed test - 2
                      completed test - 2
                      completed test - 2
                      completed test - 2
                      completed test - 2
                      completed test - 2
                      completed test - 2
                      completed test - 2
                      completed test - 2
                      completed test - 2
                      completed test - 2
                      completed test - 2
                      completed test - 2
                      completed test - 2
                      completed test - 2
                      completed test - 2
                      completed test - 2
                      completed test - 2
       completed test - 3
                      completed test - 3
                      completed test - 3
                      completed test - 3
                      completed test - 3
                      completed test - 3
                      completed test - 3
                      completed test - 3
                      completed test - 3
                      completed test - 3
                      completed test - 3
                      completed test - 3
                      completed test - 3
                      completed test - 3
                      completed test - 3
                      completed test - 3
                      completed test - 3
                      completed test - 3
                      completed test - 3
                      completed test - 3
                      completed test - 3
                      completed test - 3
                      completed test - 3
                      completed test - 3
                      completed test - 3
                      completed test - 3
                      completed test - 4
                      completed test - 4
                      completed test - 4
                      completed test - 4
                      completed test - 4
                      completed test - 4
                      completed test - 4
      .....
       {
          Collation Test failed! Source = p?ch? Target = p?che result should be <
          Exception: Collation Test failed! Source = p?ch? Target = p?che result should be <

      Demo Test 2 Table Collation object creation failed.

      java.lang.RuntimeException: Exception: Collation Test failed! Source = p?ch? Target = p?che result
      should be <

      Demo Test 2 Table Collation object creation failed.


              at CollatorTest.err(CollatorTest.java:212)
              at CollatorTest.errln(CollatorTest.java:217)
              at G7Test.TestDemoTest2(G7Test.java:176)
              at sun.reflect.NativeMethodAccessorImpl.invoke0(Native Method)
              at sun.reflect.NativeMethodAccessorImpl.invoke(NativeMethodAccessorImpl.java:30)
              at sun.reflect.InflatableMethodAccessorImpl.invoke(InflatableMethodAccessorImpl.java:46)
              at java.lang.reflect.Method.invoke(Method.java:306)
              at CollatorTest.run(CollatorTest.java:159)
              at G7Test.main(G7Test.java:38)
              at sun.reflect.NativeMethodAccessorImpl.invoke0(Native Method)
              at sun.reflect.NativeMethodAccessorImpl.invoke(NativeMethodAccessorImpl.java:30)
              at sun.reflect.InflatableMethodAccessorImpl.invoke(InflatableMethodAccessorImpl.java:46)
              at java.lang.reflect.Method.invoke(Method.java:306)
              at com.sun.javatest.regtest.MainWrapper$MainThread.run(MainWrapper.java:94)
              at java.lang.Thread.run(Thread.java:579)
          Uncaught exception thrown in test method TestDemoTest2
      ----------System.err:(18/836)----------
      java.lang.RuntimeException: Uncaught exception thrown in test method TestDemoTest2

              at CollatorTest.err(CollatorTest.java:212)
              at CollatorTest.errln(CollatorTest.java:217)
              at CollatorTest.run(CollatorTest.java:166)
              at G7Test.main(G7Test.java:38)
              at sun.reflect.NativeMethodAccessorImpl.invoke0(Native Method)
              at sun.reflect.NativeMethodAccessorImpl.invoke(NativeMethodAccessorImpl.java:30)
              at sun.reflect.InflatableMethodAccessorImpl.invoke(InflatableMethodAccessorImpl.java:46)
              at java.lang.reflect.Method.invoke(Method.java:306)
              at com.sun.javatest.regtest.MainWrapper$MainThread.run(MainWrapper.java:94)
              at java.lang.Thread.run(Thread.java:579)

      JavaTest Message: Test threw exception: java.lang.RuntimeException: Uncaught exception thrown in
      test method TestDemoTest2

      JavaTest Message: shutting down test

      STATUS:Failed.
      result: Failed. Execution failed


      test result: Failed. Execution failed

      ======================================================================

        Attachments

          Issue Links

            Activity

              People

              • Assignee:
                nlindenbsunw Norbert Lindenberg (Inactive)
                Reporter:
                jbenavrasunw Jonathan Benavraham (Inactive)
              • Votes:
                0 Vote for this issue
                Watchers:
                0 Start watching this issue

                Dates

                • Created:
                  Updated:
                  Resolved:
                  Imported:
                  Indexed: