Uploaded image for project: 'JDK'
  1. JDK
  2. JDK-4430438

RegressionTesting: FrenchTest.java: java.lang.RuntimeException:Collation Test fa

    Details

    • Subcomponent:
    • CPU:
      x86
    • OS:
      solaris_8

      Description



      Name: jbT81659 Date: 03/27/2001

      OS:Solaris(5.8)-Intel
      JDK:1.4.0-B56

      Test afiled and JTREG generated the following report:

      ====================================================
      #Test Results (version 2)
      #Sun Mar 25 12:20:56 IST 2001
      #checksum:11b66ab01475a603
      #-----testdescription-----
      $file=/home-bazelet/isam/jtreg/test/java/text/Collator/FrenchTest.java
      $root=/home-bazelet/isam/jtreg/test
      run=ASSUMED_ACTION main FrenchTest\n
      source=FrenchTest.java
      title=test French Collation

      #-----environment-----

      #-----testresult-----
      description=file:///home-bazelet/isam/jtreg/test/java/text/Collator/FrenchTest.java
      end=Sun Mar 25 12:20:56 IST 2001
      environment=regtest
      execStatus=Failed. Execution failed
      javatestOS=SunOS 5.8 (x86)
      javatestVersion=JT_2.1.4b05
      script=com.sun.javatest.regtest.RegressionScript
      sections=script_messages build main
      start=Sun Mar 25 12:20:52 IST 2001
      status=Failed. Execution failed
      test=java/text/Collator/FrenchTest.java
      work=/home-bazelet/isam/jtreg/JTwork/java/text/Collator

      #section:script_messages
      ----------messages:(1/83)----------
      JDK under test: java full version "1.4.0-beta-b56" (/home/sun/builds/jdk/solarisX)

      #section:build
      ----------messages:(3/96)----------
      command: build FrenchTest
      reason: Named class compiled on demand
      elapsed time (seconds): 0.025
      result: Passed. No need to compile: FrenchTest.java

      #section:main
      ----------messages:(3/118)----------
      command: main FrenchTest
      reason: Assumed action based on file name: run main FrenchTest
      elapsed time (seconds): 3.47
      ----------System.out:(22/1202)----------
      FrenchTest {
        TestExtra {
          Collation Test failed! Source = ? Target = ? result should be <
      java.lang.RuntimeException: Collation Test failed! Source = ? Target = ? result should be <
            at CollatorTest.err(CollatorTest.java:212)
              at CollatorTest.errln(CollatorTest.java:217)
              at FrenchTest.doTest(FrenchTest.java:91)
              at FrenchTest.TestExtra(FrenchTest.java:110)
              at sun.reflect.NativeMethodAccessorImpl.invoke0(Native Method)
              at sun.reflect.NativeMethodAccessorImpl.invoke(NativeMethodAccessorImpl.java:30)
              at sun.reflect.InflatableMethodAccessorImpl.invoke(InflatableMethodAccessorImpl.java:46)
              at java.lang.reflect.Method.invoke(Method.java:306)
              at CollatorTest.run(CollatorTest.java:159)
              at FrenchTest.main(FrenchTest.java:28)
              at sun.reflect.NativeMethodAccessorImpl.invoke0(Native Method)
              at sun.reflect.NativeMethodAccessorImpl.invoke(NativeMethodAccessorImpl.java:30)
              at sun.reflect.InflatableMethodAccessorImpl.invoke(InflatableMethodAccessorImpl.java:46)
              at java.lang.reflect.Method.invoke(Method.java:306)
              at com.sun.javatest.regtest.MainWrapper$MainThread.run(MainWrapper.java:94)
              at java.lang.Thread.run(Thread.java:579)
          Uncaught exception thrown in test method TestExtra
      ----------System.err:(18/836)----------
      java.lang.RuntimeException: Uncaught exception thrown in test method TestExtra

              at CollatorTest.err(CollatorTest.java:212)
              at CollatorTest.errln(CollatorTest.java:217)
              at CollatorTest.run(CollatorTest.java:166)
              at FrenchTest.main(FrenchTest.java:28)
              at sun.reflect.NativeMethodAccessorImpl.invoke0(Native Method)
              at sun.reflect.NativeMethodAccessorImpl.invoke(NativeMethodAccessorImpl.java:30)
              at sun.reflect.InflatableMethodAccessorImpl.invoke(InflatableMethodAccessorImpl.java:46)
              at java.lang.reflect.Method.invoke(Method.java:306)
              at com.sun.javatest.regtest.MainWrapper$MainThread.run(MainWrapper.java:94)
              at java.lang.Thread.run(Thread.java:579)

      JavaTest Message: Test threw exception: java.lang.RuntimeException: Uncaught exception thrown in
      test method TestExtra

      JavaTest Message: shutting down test

      STATUS:Failed.
      result: Failed. Execution failed
      test result: Failed. Execution failed
      ====================================================



      ======================================================================

        Attachments

          Issue Links

            Activity

              People

              • Assignee:
                nlindenbsunw Norbert Lindenberg (Inactive)
                Reporter:
                jbenavrasunw Jonathan Benavraham (Inactive)
              • Votes:
                0 Vote for this issue
                Watchers:
                0 Start watching this issue

                Dates

                • Created:
                  Updated:
                  Resolved:
                  Imported:
                  Indexed: