Uploaded image for project: 'JDK'
  1. JDK
  2. JDK-4430442

Regression Testing:Failed.Execution failed: Bug 4114080-Euro encoder test failed

    Details

      Description



      Name: jbT81659 Date: 03/27/2001

      OS: Solaris(5.8)-Intel
      JDK:1.4.0-B56

      Test failed and JTREG generated the following report
      #Test Results (version 2)
      #Sun Mar 25 12:19:24 IST 2001
      #checksum:4f8353e2c179e23a
      #-----testdescription-----
      $file=/home-bazelet/isam/jtreg/test/sun/io/Converter/EuroConverter.java
      $root=/home-bazelet/isam/jtreg/test
      keywords=bug4114080
      run=ASSUMED_ACTION main EuroConverter\n
      source=EuroConverter.java
      title=Make sure the euro converters, which are derived from existing converters, only differ from
      their parents at the expected code point.

      #-----environment-----

      #-----testresult-----
      description=file:///home-bazelet/isam/jtreg/test/sun/io/Converter/EuroConverter.java
      end=Sun Mar 25 12:19:24 IST 2001
      environment=regtest
      execStatus=Failed. Execution failed: `main' threw exception: java.lang.RuntimeException: Bug
      4114080 - Euro encoder test failed
      javatestOS=SunOS 5.8 (x86)
      javatestVersion=JT_2.1.4b05
      script=com.sun.javatest.regtest.RegressionScript
      sections=script_messages build main
      start=Sun Mar 25 12:19:19 IST 2001
      status=Failed. Execution failed: `main' threw exception: java.lang.RuntimeException: Bug 4114080 -
      Euro encoder test failed
      test=sun/io/Converter/EuroConverter.java
      work=/home-bazelet/isam/jtreg/JTwork/sun/io/Converter

      #section:script_messages
      ----------messages:(1/83)----------
      JDK under test: java full version "1.4.0-beta-b56" (/home/sun/builds/jdk/solarisX)

      #section:build
      ----------messages:(3/98)----------
      command: build EuroConverter
      reason: Named class compiled on demand
      elapsed time (seconds): 0.12
      result: Passed. No need to compile: EuroConverter.java

      #section:main
      ----------messages:(3/125)----------
      command: main EuroConverter
      reason: Assumed action based on file name: run main EuroConverter
      elapsed time (seconds): 4.581
      ----------System.out:(13/505)----------
      Checking encoder ISO8859_15_FDIS against ISO8859_1
      Checking encoder Cp923 against ISO8859_15_FDIS
      Checking encoder Cp858 against Cp850
      Checking encoder Cp1140 against Cp037
      Unsupported encoding Cp1140
      Checking encoder Cp1142 against Cp277
      Checking encoder Cp1143 against Cp278
      Checking encoder Cp1144 against Cp280
      Checking encoder Cp1145 against Cp284
      Checking encoder Cp1146 against Cp285
      Checking encoder Cp1147 against Cp297
      Checking encoder Cp1148 against Cp500
      Checking encoder Cp1149 against Cp871
      ----------System.err:(13/773)----------
      java.lang.RuntimeException: Bug 4114080 - Euro encoder test failed
              at EuroConverter.main(EuroConverter.java:104)
              at sun.reflect.NativeMethodAccessorImpl.invoke0(Native Method)
              at sun.reflect.NativeMethodAccessorImpl.invoke(NativeMethodAccessorImpl.java:30)
              at sun.reflect.InflatableMethodAccessorImpl.invoke(InflatableMethodAccessorImpl.java:46)
              at java.lang.reflect.Method.invoke(Method.java:306)
              at com.sun.javatest.regtest.MainWrapper$MainThread.run(MainWrapper.java:94)
              at java.lang.Thread.run(Thread.java:579)

      JavaTest Message: Test threw exception: java.lang.RuntimeException: Bug 4114080 - Euro encoder test
      failed
      JavaTest Message: shutting down test

      STATUS:Failed.`main' threw exception: java.lang.RuntimeException: Bug 4114080 - Euro encoder test
      failed
      result: Failed. Execution failed: `main' threw exception: java.lang.RuntimeException: Bug 4114080 -
      Euro encoder test failed


      test result: Failed. Execution failed: `main' threw exception: java.lang.RuntimeException: Bug
      4114080 - Euro encoder test failed


      ======================================================================

        Attachments

          Activity

            People

            • Assignee:
              mr Mark Reinhold
              Reporter:
              jbenavrasunw Jonathan Benavraham (Inactive)
            • Votes:
              0 Vote for this issue
              Watchers:
              0 Start watching this issue

              Dates

              • Created:
                Updated:
                Resolved:
                Imported:
                Indexed: