Uploaded image for project: 'JDK'
  1. JDK
  2. JDK-4456240

Reg-test FloatingPointInline.java Failing

    Details

    • Type: Bug
    • Status: Closed
    • Priority: P2
    • Resolution: Not an Issue
    • Affects Version/s: 1.4.0
    • Fix Version/s: None
    • Component/s: vm-legacy
    • Labels:

      Description



      Name: as83306 Date: 05/08/2001

      Regression test vm/misc/FloatingPointInline.java fails with Merlin build 63 on Linux 6.2,
      host seahund. This test has not passed within the last 10 builds.
      For test hardware config's, see http://sqesvr.eng/st3/jdk1.4/docs/Merlin-hw.html/n /n#Test Results (version 2)

      #Thu May 03 13:49:25 GMT+00:00 2001
      #checksum:335528e628ef7381
      #-----testdescription-----
      $file=/.automount/sqesvr/root/export/st1/regression/merlin/jdk1.4Tests/tests/b63/vm/misc/FloatingPointInline.java
      $root=/.automount/sqesvr/root/export/st1/regression/merlin/jdk1.4Tests/tests/b63
      keywords=bug4105954
      run=ASSUMED_ACTION main FloatingPointInline\n
      source=FloatingPointInline.java
      title=check for Spec(current) compliant rounding of intermediate results in FP calculations.

      #-----environment-----

      #-----testresult-----
      description=file:///.automount/sqesvr/root/export/st1/regression/merlin/jdk1.4Tests/tests/b63/vm/misc/FloatingPoin
      tInline.java
      end=Thu May 03 13:49:25 GMT+00:00 2001
      environment=regtest
      execStatus=Failed. Execution failed: `main' threw exception: java.lang.RuntimeException: Test Failed
      javatestOS=Linux 2.2.14-6.1.1 (i386)
      javatestVersion=JT_2.1.3i
      script=com.sun.javatest.regtest.RegressionScript
      sections=script_messages build compile main
      start=Thu May 03 13:49:20 GMT+00:00 2001
      status=Failed. Execution failed: `main' threw exception: java.lang.RuntimeException: Test Failed
      test=vm/misc/FloatingPointInline.java
      work=/export0/results/regression/merlin/b63/seahund.2.2.14-6.1.1-jth13-jdk14b63-05.03-09.14-ALL/vm/misc

      #section:script_messages
      ----------messages:(1/102)----------
      JDK under test: java full version "1.4.0-beta-b63" (/net/sqesvr/export/st1/jdk14-beta/b63/linux-i386)

      #section:build
      ----------messages:(3/105)----------
      command: build FloatingPointInline
      reason: Named class compiled on demand
      elapsed time (seconds): 2.481
      result: Passed. Compilation successful

      #section:compile
      ----------messages:(3/206)----------
      command: compile
      /.automount/sqesvr/root/export/st1/regression/merlin/jdk1.4Tests/tests/b63/vm/misc/FloatingPointInline.java
      reason: .class file out of date or does not exist
      elapsed time (seconds): 2.478
      ----------System.out:(0/0)----------
      ----------System.err:(0/0)----------
      result: Passed. Compilation successful

      #section:main
      ----------messages:(3/137)----------
      command: main FloatingPointInline
      reason: Assumed action based on file name: run main FloatingPointInline
      elapsed time (seconds): 1.947
      ----------System.out:(0/0)----------
      ----------System.err:(43/1563)----------
      Sigh: double range too big near 0
      Oops: arg double range too big near 0
      Oops: result double range too big near 0
      tiny: 1.0E-323
      tiny/small: 0.0
      (tiny/small)*big: 3.16E-322
      MIN_VALUE*big: 1.265E-321
      (tiny*big)/small: 3.16E-322
      Sigh: double range too big near infinity
      Oops: arg double range too big near infinity
      Oops: result double range too big near infinity
      huge: 8.988465674311579E307
      huge*small: Infinity
      (huge*small)/big: 2.8088955232223683E306
      eps: 1.1102230246251565E-16
      eps: 0x3ca0000000000000
      1+eps: 1.0
      (1+eps)-1: 0.0
      tiny: 2.8E-45
      tiny/small: 0.0
      (tiny/small)*big: 0.0
      MIN_VALUE*big: 3.59E-43
      (tiny*big)/small: 9.0E-44
      huge: 1.7014117E38
      huge*small: Infinity
      (huge*small)/big: Infinity
      eps: 5.9604645E-8
      eps: 0x33800000
      1+eps: 1.0
      (1+eps)-1: 0.0
      java.lang.RuntimeException: Test Failed
      at FloatingPointInline.main(FloatingPointInline.java:342)
      at sun.reflect.NativeMethodAccessorImpl.invoke0(Native Method)
      at sun.reflect.NativeMethodAccessorImpl.invoke(NativeMethodAccessorImpl.java:30)
      at sun.reflect.InflatableMethodAccessorImpl.invoke(InflatableMethodAccessorImpl.java:48)
      at java.lang.reflect.Method.invoke(Method.java:306)
      at com.sun.javatest.regtest.MainWrapper$MainThread.run(MainWrapper.java:94)
      at java.lang.Thread.run(Thread.java:579)

      JavaTest Message: Test threw exception: java.lang.RuntimeException: Test Failed
      JavaTest Message: shutting down test

      STATUS:Failed.`main' threw exception: java.lang.RuntimeException: Test Failed
      result: Failed. Execution failed: `main' threw exception: java.lang.RuntimeException: Test Failed


      test result: Failed. Execution failed: `main' threw exception: java.lang.RuntimeException: Test Failed
      ======================================================================

        Attachments

          Activity

            People

            • Assignee:
              hhuangsunw Hui Huang (Inactive)
              Reporter:
              apsmith Alan Smith (Inactive)
            • Votes:
              0 Vote for this issue
              Watchers:
              1 Start watching this issue

              Dates

              • Created:
                Updated:
                Resolved:
                Imported:
                Indexed: