Uploaded image for project: 'JDK'
  1. JDK
  2. JDK-4650666

1.4.0_02 nightly build failed with ld: fatal: Symbol referencing errors.

    XMLWordPrintable

    Details

    • Type: Bug
    • Status: Closed
    • Priority: P1
    • Resolution: Fixed
    • Affects Version/s: 1.4.0_01
    • Fix Version/s: 1.4.0_01
    • Component/s: infrastructure
    • Labels:
      None
    • Subcomponent:
    • Resolved In Build:
      01
    • CPU:
      sparc
    • OS:
      solaris_2.6
    • Verification:
      Verified

      Description


      Date nightly build failed : 03/08/2002

      nightly build failed for jdk1.4.0_01, log as:
      Undefined first referenced
       symbol in file
      Java_java_nio_Bits_copyToDoubleArray ../../../build/solaris-sparc/tmp/java/java.lang/java/mapfile-v
      ers
      Java_java_nio_Bits_copyFromFloatArray ../../../build/solaris-sparc/tmp/java/java.lang/java/mapfile-
      vers
      Java_java_nio_Bits_copyToFloatArray ../../../build/solaris-sparc/tmp/java/java.lang/java/mapfile-ve
      rs
      Java_java_nio_Bits_copyToLongArray ../../../build/solaris-sparc/tmp/java/java.lang/java/mapfile-ve
      rs
      Java_java_nio_Bits_copyToIntArray ../../../build/solaris-sparc/tmp/java/java.lang/java/mapfile-ve
      rs
      Java_java_nio_Bits_copyFromLongArray ../../../build/solaris-sparc/tmp/java/java.lang/java/mapfile-v
      ers
      Java_java_nio_Bits_copyFromDoubleArray ../../../build/solaris-sparc/tmp/java/java.lang/java/mapfile
      -vers
      Java_java_nio_Bits_copyFromIntArray ../../../build/solaris-sparc/tmp/java/java.lang/java/mapfile-ve
      rs
      Java_java_nio_Bits_copyToShortArray ../../../build/solaris-sparc/tmp/java/java.lang/java/mapfile-ve
      rs
      Java_java_nio_Bits_copyFromByteArray ../../../build/solaris-sparc/tmp/java/java.lang/java/mapfile-v
      ers
      Java_java_nio_Bits_copyToByteArray ../../../build/solaris-sparc/tmp/java/java.lang/java/mapfile-ve
      rs
      Java_sun_misc_AtomicLongCSImpl_attemptUpdate ../../../build/solaris-sparc/tmp/java/java.lang/java/m
      apfile-vers
      Java_java_nio_Bits_copyFromShortArray ../../../build/solaris-sparc/tmp/java/java.lang/java/mapfile-
      vers
      Java_sun_misc_AtomicLong_VMSupportsCS8 ../../../build/solaris-sparc/tmp/java/java.lang/java/mapfile
      -vers
      ld: fatal: Symbol referencing errors. No output written to ../../../build/solaris-sparc/lib/sparc/l
      ibjava.so
      gnumake[3]: *** [../../../build/solaris-sparc/lib/sparc/libjava.so] Error 1
      gnumake[3]: Leaving directory `/export1/nightly/1.4.0/src/j2se/make/java/java'
      gnumake[2]: *** [optimized] Error 2
      gnumake[2]: Leaving directory `/export1/nightly/1.4.0/src/j2se/make/java/java'
      gnumake[1]: *** [all] Error 1
      gnumake[1]: Leaving directory `/export1/nightly/1.4.0/src/j2se/make/java'
      gnumake: *** [all] Error 1
      >>>Making images @ Sat Mar 9 01:24:12 PST 2002 ...
      WARNING: Your solaris install is missing the required patch 105568-24
               Please update your your system patches or build on a different machine.

        Attachments

          Activity

            People

            Assignee:
            minqi Yumin Qi
            Reporter:
            minqi Yumin Qi
            Votes:
            0 Vote for this issue
            Watchers:
            0 Start watching this issue

              Dates

              Created:
              Updated:
              Resolved:
              Imported:
              Indexed: