Uploaded image for project: 'JDK'
  1. JDK
  2. JDK-4668603

popframe005, popframes001 and popframes004 failing on serverVM -Xcomp

    XMLWordPrintable

    Details

    • Subcomponent:
    • CPU:
      generic, sparc
    • OS:
      generic, solaris_7

      Description

      Build: 1.4.1-beta-b07
      Platform: All platforms
      VM: ServerVM
      Mode: -Xcomp
      HotSpot Version:
      java version "1.4.1-beta"
      Java(TM) 2 Runtime Environment, Standard Edition (build 1.4.1-beta-b08)
      Java HotSpot(TM) Server VM (build 20020412175048.jmasa.b10-fastdebug-debug, compiled mode)


      How to reproduce:
      cd /net/jano.sfbay/export/disk20/GammaBase/Bugs/<bug-id>
      sh doit.sh

      -------------------------------TC-1------------------------
      Running the test with Hopper-weekahead
      java version "1.4.1-beta"
      Java(TM) 2 Runtime Environment, Standard Edition (build 1.4.1-beta-b08)
      Java HotSpot(TM) Server VM (build 20020412175048.jmasa.b10-fastdebug-debug, compiled mode)
      Running Testcase nsk/jvmdi/PopFrame/popframe005
      popFrameCls (Thread[Thread-1,5,main]): inside activeMethod()
      TEST FAILED: the lockObj[0]'s monitor became free too early
      TEST FAILED: Lock acquired by a frame, different from the popped one,
              was released when the popped frame had been popped

      -----------------------------------------------------------
      -------------------------------TC-2------------------------
      Running Testcase nsk/jdi/ThreadReference/popFrames/popframes001
      # ERROR: ##> debugger: ERROR: Exception : nsk.jdi.ThreadReference.popFrames.popframes001$JDITestRuntimeException: JDITestRuntimeException : ** unexpected breakpoint **
      # ERROR: ##> debugger: test phase has not finished normally: debuggee is still alive
      TEST FAILED

      -----------------------------------------------------------
      -------------------------------TC-3------------------------
      Running Testcase nsk/jdi/ThreadReference/popFrames/popframes004
      # ERROR: ##> debugger: ERROR: Exception : nsk.jdi.ThreadReference.popFrames.popframes004$JDITestRuntimeException: JDITestRuntimeException : ** EXCEPTION while waiting for event ** : nsk.jdi.ThreadReference.popFrames.popframes004$JDITestRuntimeException: JDITestRuntimeException : ** TIMEOUT while waiting for event **
      # ERROR: ##> debugger: test phase has not finished normally: debuggee is still alive
      TEST FAILED

      -----------------------------------------------------------

      Machine to reproduce: corellia

      Name: dkR10014 Date: 05/22/2002


      This bug also affects the following nsk jdwp test:
       nsk/jdwp/StackFrame/PopFrames/popframes001


      ======================================================================

        Attachments

          Issue Links

            Activity

              People

              Assignee:
              kbr Kenneth Russell (Inactive)
              Reporter:
              mavvarisunw Madhava Avvari (Inactive)
              Votes:
              0 Vote for this issue
              Watchers:
              0 Start watching this issue

                Dates

                Created:
                Updated:
                Resolved:
                Imported:
                Indexed: