Uploaded image for project: 'JDK'
  1. JDK
  2. JDK-4680525

WIN64: JCK1.4: 2 api/java_net/SocketPermission/SocketPermissionTests.html tests

    Details

    • Type: Bug
    • Status: Closed
    • Priority: P2
    • Resolution: Duplicate
    • Affects Version/s: 1.4.1
    • Fix Version/s: None
    • Component/s: core-libs
    • Subcomponent:
    • CPU:
      itanium
    • OS:
      windows_xp

      Description


      Filed By : J2SE-SQA [###@###.###
      JDK : J2SE 1.4.1-test-test
      JCK : jck1.4-b17
      Platform[s] : Windows XP 64 bit
      switch/Mode : -Xinterpreter -Xfuture
      JCK test owner : http://javaweb.eng/jck/usr/owners.jto
      Falling test[s]: api/java_net/SocketPermission/SocketPermissionTests.html#hashCodeTests
                       api/java_net/SocketPermission/SocketPermissionTests.html#impliesTests

      Test source location:
      =====================
      /net/jdk/export/disk8/local.java/jck1.4/JCK-runtime-14/tests/api/java_net/SocketPermission/hashCodeTests.java
      /net/jdk/export/disk8/local.java/jck1.4/JCK-runtime-14/tests/api/java_net/SocketPermission/impliesTests.java

      jtr file location:
      ==================
      /net/jtgb4u4c.eng/export/sail15/results/hopper/PIT/itanium/jck14/win/workDir/api/java_net/SocketPermission/SocketPermissionTests_hashCodeTests.jtr
      /net/jtgb4u4c.eng/export/sail15/results/hopper/PIT/itanium/jck14/win/workDir/api/java_net/SocketPermission/SocketPermissionTests_impliesTests.jtr

      How to reproduce:
      =================

      Run the following script (you may need to change JCK, JDK, HOST_NAME and
      HOST_IP variables; please do not use "localhost" and "127.0.0.1" as host name
      and ip address):


      --- script start ---
      #!/bin/sh

      JCK=I:/sail16/JCK/jck14/JCK-runtime-14
      JDK=c:/j2sdk1.4.1

      HOST_NAME=jcc-itanium-01 # local host name
      HOST_IP=10.5.17.173 # local host ip

      flags="-Xfuture -verify -Xinterpreter -Xmx256m -Djava.security.policy=${JCK}/lib/jck.policy"

      echo "#### api/java_net/SocketPermission/SocketPermissionTests.html#hashCodeTests"
      ${JDK}/bin/java -classpath "${JCK}/classes;${JCK}/javatest.jar" ${flags} javasoft.sqe.tests.api.java.net.SocketPermission.hashCodeTests -network.localHost ${HOST_NAME}/${HOST_IP} -network.testHost1 mizu/10.5.32.16 -WorkDir .
      res=$?
      if [ "${res}" != "95" ]; then
      echo "*** Test FAILED: ${res}"
      else
      echo "*** Test PASSED"
      fi

      echo "#### api/java_net/SocketPermission/SocketPermissionTests.html#impliesTests"
      ${JDK}/bin/java -classpath "${JCK}/classes;${JCK}/javatest.jar" ${flags} javasoft.sqe.javatest.lib.ExecJCKTestSameJVMCmd javasoft.sqe.tests.api.java.net.SocketPermission.impliesTests -network.localHost ${HOST_NAME}/${HOST_IP} -network.testHost1 mizu/10.5.32.16 -WorkDir .
      res=$?
      if [ "${res}" != "95" ]; then
      echo "*** Test FAILED: ${res}"
      else
      echo "*** Test PASSED"
      fi
      --- script end ---

      Test output:
      ============
      #### api/java_net/SocketPermission/SocketPermissionTests.html#hashCodeTests
      *** Test FAILED: 128
      #### api/java_net/SocketPermission/SocketPermissionTests.html#impliesTests
      *** Test FAILED: 128

      Test output (build "1.4.1-MuraliKrishna-ia64-xp-build", May 7)
      ==============================================================
      #### api/java_net/SocketPermission/SocketPermissionTests.html#hashCodeTests

      An unexpected exception has been detected in native code outside the VM.
      Unexpected Signal : EXCEPTION_ACCESS_VIOLATION occurred at PC=0xE9195750
      Function=[Unknown.]
      Library=C:\j2sdk1.4.1\bin\net.dll

      NOTE: We are unable to locate the function name symbol for the error
            just occurred. Please refer to release documentation for possible
            reason and solutions.


      Current Java thread:
      at java.net.Inet4AddressImpl.getHostByAddr(Native Method)
      at java.net.InetAddress$1.getHostByAddr(InetAddress.java:722)
      at java.net.InetAddress.getHostFromNameService(InetAddress.java:464)
      at java.net.InetAddress.getHostName(InetAddress.java:407)
      at java.net.SocketPermission.getCanonName(SocketPermission.java:556)
      at java.net.SocketPermission.hashCode(SocketPermission.java:865)
      at javasoft.sqe.tests.api.java.net.SocketPermission.hashCodeTests.run(hashCodeTests.java:56)
      at javasoft.sqe.tests.api.java.net.SocketPermission.hashCodeTests.main(hashCodeTests.java:92)

      Dynamic libraries:
      0x0000000000400000 - 0x0000000000414000 c:\j2sdk1.4.1\bin\java.EXE
      0x0000000077E80000 - 0x0000000077FFC000 C:\WINDOWS\System32\ntdll.dll
      0x0000000077CA0000 - 0x0000000077E78000 C:\WINDOWS\system32\kernel32.dll
      0x0000000077B10000 - 0x0000000077C9A000 C:\WINDOWS\system32\ADVAPI32.dll
      0x0000000077790000 - 0x000000007798C000 C:\WINDOWS\system32\RPCRT4.dll
      0x00000000775B0000 - 0x00000000776A2000 C:\WINDOWS\system32\MSVCRT.dll
      0x0000000008000000 - 0x0000000008244000 c:\j2sdk1.4.1\bin\server\jvm.dll
      0x0000000077990000 - 0x0000000077B04000 C:\WINDOWS\system32\USER32.dll
      0x00000000776B0000 - 0x000000007778A000 C:\WINDOWS\system32\GDI32.dll
      0x0000000074F10000 - 0x0000000074F92000 C:\WINDOWS\System32\WINMM.dll
      0x0000000010000000 - 0x0000000010016000 c:\j2sdk1.4.1\bin\hpi.dll
      0x000006FBFFB20000 - 0x000006FBFFB44000 c:\j2sdk1.4.1\bin\verify.dll
      0x000006FBFFAC0000 - 0x000006FBFFB14000 c:\j2sdk1.4.1\bin\java.dll
      0x000006FBFFA90000 - 0x000006FBFFAB8000 c:\j2sdk1.4.1\bin\zip.dll
      0x000006FBE9190000 - 0x000006FBE91B6000 C:\j2sdk1.4.1\bin\net.dll
      0x000000006A2C0000 - 0x000000006A2D0000 C:\WINDOWS\System32\WSOCK32.dll
      0x000000006A270000 - 0x000000006A2BA000 C:\WINDOWS\System32\WS2_32.dll
      0x000000006A250000 - 0x000000006A26A000 C:\WINDOWS\System32\WS2HELP.dll
      0x000000006A160000 - 0x000000006A220000 C:\WINDOWS\System32\mswsock.dll
      0x00000000758B0000 - 0x000000007591E000 C:\WINDOWS\System32\DNSAPI.dll
      0x0000000075A00000 - 0x0000000075A18000 C:\WINDOWS\System32\winrnr.dll
      0x0000000075940000 - 0x00000000759BE000 C:\WINDOWS\system32\WLDAP32.dll
      0x0000000075A20000 - 0x0000000075A30000 C:\WINDOWS\System32\rasadhlp.dll
      0x0000000075270000 - 0x000000007529E000 C:\WINDOWS\system32\imagehlp.dll
      0x0000000060A20000 - 0x0000000060C1A000 C:\WINDOWS\system32\DBGHELP.dll
      0x0000000077590000 - 0x00000000775A8000 C:\WINDOWS\system32\VERSION.dll
      0x0000000075100000 - 0x000000007511E000 C:\WINDOWS\System32\PSAPI.DLL
      0x0000000000000000 - 0x0000000000014000 c:\j2sdk1.4.1\bin\java.EXE
      0x0000000000000000 - 0x0000000000000000
      0x0000000000000000 - 0x0000000000000000
      0x0000000000000000 - 0x0000000000000000
      0x0000000000000000 - 0x0000000000014000 c:\j2sdk1.4.1\bin\java.EXE
      0x0000000000000000 - 0x0000000000014000 c:\j2sdk1.4.1\bin\java.EXE
      0x0000000000000000 - 0x0000000000014000 c:\j2sdk1.4.1\bin\java.EXE
      0x0000000000000000 - 0x0000000000014000 c:\j2sdk1.4.1\bin\java.EXE
      0x0000000000000000 - 0x0000000000014000 c:\j2sdk1.4.1\bin\java.EXE
      0x0000000000000000 - 0x0000000000014000 c:\j2sdk1.4.1\bin\java.EXE
      0x0000000000000000 - 0x0000000000014000 c:\j2sdk1.4.1\bin\java.EXE
      0x0000000000000000 - 0x0000000000014000 c:\j2sdk1.4.1\bin\java.EXE
      0x0000000000000000 - 0x0000000000014000 c:\j2sdk1.4.1\bin\java.EXE
      0x0000000000000000 - 0x0000000000014000 c:\j2sdk1.4.1\bin\java.EXE
      0x0000000000000000 - 0x0000000000014000 c:\j2sdk1.4.1\bin\java.EXE
      0x0000000000000000 - 0x0000000000014000 c:\j2sdk1.4.1\bin\java.EXE
      0x0000000000000000 - 0x0000000000014000 c:\j2sdk1.4.1\bin\java.EXE
      0x0000000000000000 - 0x0000000000014000 c:\j2sdk1.4.1\bin\java.EXE
      0x0000000000000000 - 0x0000000000014000 c:\j2sdk1.4.1\bin\java.EXE
      0x0000000000000000 - 0x0000000000014000 c:\j2sdk1.4.1\bin\java.EXE
      0x0000000000000000 - 0x0000000000014000 c:\j2sdk1.4.1\bin\java.EXE
      0x0000000000000000 - 0x0000000000014000 c:\j2sdk1.4.1\bin\java.EXE
      0x0000000000000000 - 0x0000000000014000 c:\j2sdk1.4.1\bin\java.EXE
      0x0000000000000000 - 0x0000000000014000 c:\j2sdk1.4.1\bin\java.EXE
      0x0000000000000000 - 0x0000000000014000 c:\j2sdk1.4.1\bin\java.EXE
      0x0000000000000000 - 0x0000000000014000 c:\j2sdk1.4.1\bin\java.EXE
      0x0000000000000000 - 0x0000000000014000 c:\j2sdk1.4.1\bin\java.EXE

      Local Time = Wed May 08 08:27:40 2002
      Elapsed Time = 1
      #
      # The exception above was detected in native code outside the VM
      #
      # Java VM: Java HotSpot(TM) 64-Bit Core VM (1.4.1-MuraliKrishna-ia64-xp-build-12 interpreted mode)
      #
      # An error report file has been saved as hs_err_pid3660.log.
      # Please refer to the file for further information.
      #
      *** Test FAILED: 1
      #### api/java_net/SocketPermission/SocketPermissionTests.html#impliesTests

      An unexpected exception has been detected in native code outside the VM.
      Unexpected Signal : EXCEPTION_ACCESS_VIOLATION occurred at PC=0xE9195750
      Function=[Unknown.]
      Library=C:\j2sdk1.4.1\bin\net.dll

      NOTE: We are unable to locate the function name symbol for the error
            just occurred. Please refer to release documentation for possible
            reason and solutions.


      Current Java thread:
      at java.net.Inet4AddressImpl.getHostByAddr(Native Method)
      at java.net.InetAddress$1.getHostByAddr(InetAddress.java:722)
      at java.net.InetAddress.getHostFromNameService(InetAddress.java:464)
      at java.net.InetAddress.getHostName(InetAddress.java:407)
      at java.net.SocketPermission.getCanonName(SocketPermission.java:556)
      at java.net.SocketPermission.impliesIgnoreMask(SocketPermission.java:752)
      at java.net.SocketPermission.implies(SocketPermission.java:643)
      at javasoft.sqe.tests.api.java.net.SocketPermission.impliesTests.check(impliesTests.java:148)
      at javasoft.sqe.tests.api.java.net.SocketPermission.impliesTests.run(impliesTests.java:74)
      at com.sun.jck.lib.ExecJCKTestSameJVMCmd.executeOldTest(ExecJCKTestSameJVMCmd.java:272)
      at com.sun.jck.lib.ExecJCKTestSameJVMCmd.run(ExecJCKTestSameJVMCmd.java:161)
      at com.sun.jck.lib.ExecJCKTestSameJVMCmd.main(ExecJCKTestSameJVMCmd.java:62)

      Dynamic libraries:
      0x0000000000400000 - 0x0000000000414000 c:\j2sdk1.4.1\bin\java.EXE
      0x0000000077E80000 - 0x0000000077FFC000 C:\WINDOWS\System32\ntdll.dll
      0x0000000077CA0000 - 0x0000000077E78000 C:\WINDOWS\system32\kernel32.dll
      0x0000000077B10000 - 0x0000000077C9A000 C:\WINDOWS\system32\ADVAPI32.dll
      0x0000000077790000 - 0x000000007798C000 C:\WINDOWS\system32\RPCRT4.dll
      0x00000000775B0000 - 0x00000000776A2000 C:\WINDOWS\system32\MSVCRT.dll
      0x0000000008000000 - 0x0000000008244000 c:\j2sdk1.4.1\bin\server\jvm.dll
      0x0000000077990000 - 0x0000000077B04000 C:\WINDOWS\system32\USER32.dll
      0x00000000776B0000 - 0x000000007778A000 C:\WINDOWS\system32\GDI32.dll
      0x0000000074F10000 - 0x0000000074F92000 C:\WINDOWS\System32\WINMM.dll
      0x0000000010000000 - 0x0000000010016000 c:\j2sdk1.4.1\bin\hpi.dll
      0x000006FBFFB20000 - 0x000006FBFFB44000 c:\j2sdk1.4.1\bin\verify.dll
      0x000006FBFFAC0000 - 0x000006FBFFB14000 c:\j2sdk1.4.1\bin\java.dll
      0x000006FBFFA90000 - 0x000006FBFFAB8000 c:\j2sdk1.4.1\bin\zip.dll
      0x000006FBE9190000 - 0x000006FBE91B6000 C:\j2sdk1.4.1\bin\net.dll
      0x000000006A2C0000 - 0x000000006A2D0000 C:\WINDOWS\System32\WSOCK32.dll
      0x000000006A270000 - 0x000000006A2BA000 C:\WINDOWS\System32\WS2_32.dll
      0x000000006A250000 - 0x000000006A26A000 C:\WINDOWS\System32\WS2HELP.dll
      0x000000006A160000 - 0x000000006A220000 C:\WINDOWS\System32\mswsock.dll
      0x00000000758B0000 - 0x000000007591E000 C:\WINDOWS\System32\DNSAPI.dll
      0x0000000075A00000 - 0x0000000075A18000 C:\WINDOWS\System32\winrnr.dll
      0x0000000075940000 - 0x00000000759BE000 C:\WINDOWS\system32\WLDAP32.dll
      0x0000000075A20000 - 0x0000000075A30000 C:\WINDOWS\System32\rasadhlp.dll
      0x0000000075270000 - 0x000000007529E000 C:\WINDOWS\system32\imagehlp.dll
      0x0000000060A20000 - 0x0000000060C1A000 C:\WINDOWS\system32\DBGHELP.dll
      0x0000000077590000 - 0x00000000775A8000 C:\WINDOWS\system32\VERSION.dll
      0x0000000075100000 - 0x000000007511E000 C:\WINDOWS\System32\PSAPI.DLL
      0x0000000000000000 - 0x0000000000014000 c:\j2sdk1.4.1\bin\java.EXE
      0x0000000000000000 - 0x0000000000000000
      0x0000000000000000 - 0x0000000000000000
      0x0000000000000000 - 0x0000000000000000
      0x0000000000000000 - 0x0000000000014000 c:\j2sdk1.4.1\bin\java.EXE
      0x0000000000000000 - 0x0000000000014000 c:\j2sdk1.4.1\bin\java.EXE
      0x0000000000000000 - 0x0000000000014000 c:\j2sdk1.4.1\bin\java.EXE
      0x0000000000000000 - 0x0000000000014000 c:\j2sdk1.4.1\bin\java.EXE
      0x0000000000000000 - 0x0000000000014000 c:\j2sdk1.4.1\bin\java.EXE
      0x0000000000000000 - 0x0000000000014000 c:\j2sdk1.4.1\bin\java.EXE
      0x0000000000000000 - 0x0000000000014000 c:\j2sdk1.4.1\bin\java.EXE
      0x0000000000000000 - 0x0000000000014000 c:\j2sdk1.4.1\bin\java.EXE
      0x0000000000000000 - 0x0000000000014000 c:\j2sdk1.4.1\bin\java.EXE
      0x0000000000000000 - 0x0000000000014000 c:\j2sdk1.4.1\bin\java.EXE
      0x0000000000000000 - 0x0000000000014000 c:\j2sdk1.4.1\bin\java.EXE
      0x0000000000000000 - 0x0000000000014000 c:\j2sdk1.4.1\bin\java.EXE
      0x0000000000000000 - 0x0000000000014000 c:\j2sdk1.4.1\bin\java.EXE
      0x0000000000000000 - 0x0000000000014000 c:\j2sdk1.4.1\bin\java.EXE
      0x0000000000000000 - 0x0000000000014000 c:\j2sdk1.4.1\bin\java.EXE
      0x0000000000000000 - 0x0000000000014000 c:\j2sdk1.4.1\bin\java.EXE
      0x0000000000000000 - 0x0000000000014000 c:\j2sdk1.4.1\bin\java.EXE
      0x0000000000000000 - 0x0000000000014000 c:\j2sdk1.4.1\bin\java.EXE
      0x0000000000000000 - 0x0000000000014000 c:\j2sdk1.4.1\bin\java.EXE
      0x0000000000000000 - 0x0000000000014000 c:\j2sdk1.4.1\bin\java.EXE
      0x0000000000000000 - 0x0000000000014000 c:\j2sdk1.4.1\bin\java.EXE
      0x0000000000000000 - 0x0000000000014000 c:\j2sdk1.4.1\bin\java.EXE
      0x0000000000000000 - 0x0000000000014000 c:\j2sdk1.4.1\bin\java.EXE

      Local Time = Wed May 08 08:27:42 2002
      Elapsed Time = 1
      #
      # The exception above was detected in native code outside the VM
      #
      # Java VM: Java HotSpot(TM) 64-Bit Core VM (1.4.1-MuraliKrishna-ia64-xp-build-12 interpreted mode)
      #
      # An error report file has been saved as hs_err_pid2708.log.
      # Please refer to the file for further information.
      #
      *** Test FAILED: 1

      Specific Machine Info:
      ======================
      Hostname: jcc-itanium-01
      OS: Windows XP 64bit Edition

        Attachments

          Issue Links

            Activity

              People

              • Assignee:
                michaelm Michael McMahon
                Reporter:
                atwosunw A2 A2 (Inactive)
              • Votes:
                0 Vote for this issue
                Watchers:
                0 Start watching this issue

                Dates

                • Created:
                  Updated:
                  Resolved:
                  Imported:
                  Indexed: