Uploaded image for project: 'JDK'
  1. JDK
  2. JDK-4680596

WIN64: JCK1.4: api/javax_rmi/CORBA/Util/unexportObject.html#UnexObj0002 fails

    XMLWordPrintable

    Details

    • Type: Bug
    • Status: Closed
    • Priority: P2
    • Resolution: Duplicate
    • Affects Version/s: 1.4.1
    • Fix Version/s: None
    • Component/s: core-libs
    • Labels:
    • Subcomponent:
    • CPU:
      itanium
    • OS:
      windows_xp

      Description


      Filed By : J2SE-SQA [###@###.###
      JDK : J2SE 1.4.1-test-test
      JCK : jck1.4-b17
      Platform[s] : Windows XP 64 bit
      switch/Mode : -Xinterpreter -Xfuture
      JCK test owner : http://javaweb.eng/jck/usr/owners.jto
      Falling test[s]: api/javax_rmi/CORBA/Util/unexportObject.html#UnexObj0002

      Test source location:
      =====================
      /net/jdk/export/disk8/local.java/jck1.4/JCK-runtime-14/tests/api/javax_rmi/CORBA/Util/UnexObjTests.java

      jtr file location:
      ==================
      /net/jtgb4u4c.eng/export/sail15/results/hopper/PIT/itanium/jck14/win/workDir/api/javax_rmi/CORBA/Util/unexportObject_UnexObj0002.jtr

      How to reproduce:
      =================

      Run the following script (you may need to change JCK and JDK variables):

      --- script start ---
      #!/bin/sh

      JCK=I:/sail16/JCK/jck14/JCK-runtime-14
      JDK=c:/j2sdk1.4.1

      flags="-Xfuture -verify -Xinterpreter -Xmx256m -Djava.security.policy=${JCK}/lib/jck.policy"

      ${JDK}/bin/java -classpath "${JCK}/classes;${JCK}/javatest.jar" ${flags} javasoft.sqe.tests.api.javax.rmi.CORBA.Util.UnexObjTests -TestCaseID UnexObj0002
      res=$?
      if [ "${res}" != "95" ]; then
      echo "*** Test FAILED: ${res}"
      else
      echo "*** Test PASSED"
      fi
      --- script end ---

      Test output:
      ============
      *** Test FAILED: 128

      Test output (build "1.4.1-MuraliKrishna-ia64-xp-build", May 7)
      ==============================================================
      STATUS:Failed.Failed during test setup Error : null
      *** Test FAILED: 97

      Specific Machine Info:
      ======================
      Hostname: jcc-itanium-01
      OS: Windows XP 64bit Edition

        Attachments

          Issue Links

            Activity

              People

              Assignee:
              michaelm Michael McMahon
              Reporter:
              atwosunw A2 A2 (Inactive)
              Votes:
              0 Vote for this issue
              Watchers:
              0 Start watching this issue

                Dates

                Created:
                Updated:
                Resolved:
                Imported:
                Indexed: