Uploaded image for project: 'JDK'
  1. JDK
  2. JDK-4688172

Testbase_VM tests throws exception as "java.io.IOException" on Linux_ia64

    Details

    • Type: Bug
    • Status: Closed
    • Priority: P3
    • Resolution: Not an Issue
    • Affects Version/s: 1.4.1
    • Fix Version/s: None
    • Component/s: hotspot
    • Labels:
    • Subcomponent:
    • Introduced In Build:
      beta
    • Introduced In Version:
    • CPU:
      x86
    • OS:
      linux_redhat_7.2

      Description

      Test failed : testbase_vm/src/misc/loops/dec04 dec04
                     testbase_vm/src/misc/loops/dec03 dec03
                     testbase_vm/src/misc/1.1E_regress/bug011 bug011
                     
      Failed mode : -Xint
      Platform : Itanium Linux (linux_ia64)
      VM : Server

      To reproduce :

      * Go to /net/jano.sfbay/export/disk20/GammaBase/Bugs/{BugId}
      * execute rerun.sh

      Failure :
      ......................................
      [Enter:bug011]
      java.io.IOException: java.io.IOException: java: not found
              at java.lang.UNIXProcess.<init>(UNIXProcess.java:143)
              at java.lang.Runtime.execInternal(Native Method)
              at java.lang.Runtime.exec(Runtime.java:566)
              at java.lang.Runtime.exec(Runtime.java:428)
              at java.lang.Runtime.exec(Runtime.java:364)
              at java.lang.Runtime.exec(Runtime.java:326)
              at bug011.main(bug011.java:8)
              at sun.reflect.NativeMethodAccessorImpl.invoke0(Native Method)
              at sun.reflect.NativeMethodAccessorImpl.invoke(NativeMethodAccessorImp.java:39)
              at sun.reflect.DelegatingMethodAccessorImpl.invoke(DelegatingMethodAccssorImpl.java:25)
              at java.lang.reflect.Method.invoke(Method.java:324)
              at runThese$TestRunner.runTest(runThese.java:577)
              at runThese$TestRunner.run(runThese.java:501)
      #Failed - Exception: [java.io.IOException]; bug011; (1,0,1,0,0)
      [Exit:bug011]
      ......................................
      [Enter:dec03]
      start loop s011
      end loop s011
      start loop s012
      loop12 loopcount =0a = 1001.0b = -0.0c = 1001.0
      loop12 loopcount =1a = 999.0b = -1.0c = 1000.0
      loop12 loopcount =2a = -997.0b = 2.0c = -999.0
      loop12 loopcount =3a = 995.0b = -3.0c = 998.0
      loop12 loopcount =4a = -993.0b = 4.0c = -997.0
      loop12 loopcount =5a = 991.0b = -5.0c = 996.0
      loop12 loopcount =6a = -989.0b = 6.0c = -995.0
      loop12 loopcount =7a = 987.0b = -7.0c = 994.0
      loop12 loopcount =8a = -985.0b = 8.0c = -993.0
      loop12 loopcount =9a = 983.0b = -9.0c = 992.0


        Attachments

          Activity

            People

            • Assignee:
              collins Gary Collins (Inactive)
              Reporter:
              dhvaradhsunw Dhanalakshmi Varadharaj (Inactive)
            • Votes:
              0 Vote for this issue
              Watchers:
              1 Start watching this issue

              Dates

              • Created:
                Updated:
                Resolved:
                Imported:
                Indexed: