Uploaded image for project: 'JDK'
  1. JDK
  2. JDK-4949961

Regression-cte CTE_REGTEST/Generic/4747962/DialogTest.java fails

    Details

    • Subcomponent:
    • Resolved In Build:
      beta
    • CPU:
      x86, sparc
    • OS:
      linux, solaris_8, solaris_10
    • Verification:
      Verified

      Description



      Name: kaR10181 Date: 11/06/2003


      Filed By : J2SE-SQA [###@###.###
      JDK : JDK1.5.0-b26
      Testbase : Regression-cte
      Platform[s] : RedHat Advanced Server 2.1 (Gnome), RedHat 9.0 (KDE)
      switch/Mode : -server
      Falling test[s]:

               CTE_REGTEST/Generic/4747962/DialogTest.java

      Regression-cte CTE_REGTEST/Generic/4747962/DialogTest.java test fails with JDK1.5.0-b26
      on Linux and passes on Windows and x86. The test is new for Regression-cte testsuite.

      Test source location:
      =====================
      /net/jdk/export/jpse04/Regression/1.5.0/test/CTE_REGTEST/Generic/4747962/DialogTest.java

      jtr file location:
      ==================
      /net/jtgb4u4c.sfbay/export/sail15/results.2/tiger/b26/regtest/linux/redhat_advserver21_gnome_smp_linux-24/workDir/cte/CTE_REGTEST/Generic/4747962/DialogTest.jtr

      How to reproduce:
      =================
      Run the following script (you may need to change its variables)

      --- script start ---
      #!/bin/sh
      RESULT_DIR=`pwd`
      WORK_DIR=$RESULT_DIR/workDir/test
      REPORT_DIR=$RESULT_DIR/reportDir

      #Paths in Java Software:
      JT_HOME="/java/re/jct-tools/3.1.2/archive/fcs/binaries"
      JEMMY_JAR="/net/jdk/export/jpse04/Jemmy/jemmy.jar"
      JAVA_HOME="/java/re/jdk/1.5.0/promoted/all/b26/binaries/linux-i586"
      TEST_BASE_PATH="/net/jdk/export/jpse04/Regression/1.5.0/test"

      #Alternative paths outside Java Software:
      #JT_HOME="/net/koori.sfbay/onestop/jct-tools/3.1.2/archive/fcs/binaries"
      #JEMMY_JAR="/net/jdk/export/jpse04/Jemmy/jemmy.jar"
      #JAVA_HOME="/net/koori.sfbay/onestop/jdk/1.5.0/promoted/all/b26/binaries/linux-i586"
      #TEST_BASE_PATH="/net/jdk/export/jpse04/Regression/1.5.0/test"

      #Alternative paths for the NSK site:
      #JT_HOME="/net/linux-15/export/home/java/jct"
      #JEMMY_JAR="$JT_HOME/jemmy/jemmy.jar"
      #JAVA_HOME="/net/linux-15/export/home/java/jdk1.5.0/linux"
      #TEST_BASE_PATH="/net/linux-15/export/home/java/regtest.tiger/cte"


      TESTVMOPTS="-server"
      CLASSPATH="$JT_HOME/classes:$JT_HOME/lib/javatest.jar:$JT_HOME/lib/jtreg.jar"

      TEST="CTE_REGTEST/Generic/4747962/DialogTest.java"

      mkdir -p $WORK_DIR/scratch 2>&1
      mkdir -p $WORK_DIR/jtData 2>&1
      mkdir -p $REPORT_DIR 2>&1

      #rm $WORK_DIR/jtData/ResultCache.jtw 2>&1

      cd $WORK_DIR/scratch

      $JAVA_HOME/bin/java -server -cp $CLASSPATH -DenvVars=TESTJAVAHOME=$JAVA_HOME,TESTVMOPTS=$TESTVMOPTS,DISPLAY=:0,HOME=$HOME/.regtest,PATH=/bin:/usr/bin,CPAPPEND=$JEMMY_JAR,TZ=,LC_ALL=en_US,LC_CTYPE=en_US,LANG=en_US,LPDEST= -DDISPLAY=:0 -DlocalHost="linux-24" -Dprogram=jtreg com.sun.javatest.regtest.Main -a -v default -batch -params -w "$WORK_DIR" -r "$REPORT_DIR" -t "$TEST_BASE_PATH" "$TEST_BASE_PATH/$TEST"

      --- script end ---

      Script output:
      ==============

      ----------System.out:(13/1063)----------
      Trace:
      Start to wait frame "Frame with title "Dummy"" opened
      Trace:
      Frame "Frame with title "Dummy"" has been opened in 7 milliseconds

      javax.swing.JFrame[frame0,400,100,200x100,layout=java.awt.BorderLayout,title=Dummy,resizable,normal,defaultCloseOperation=HIDE_ON_CLOSE,rootPane=javax.swing.JRootPane[,6,20,188x74,layout=javax.swing.JRootPane$RootLayout,alignmentX=0.0,alignmentY=0.0,border=,flags=449,maximumSize=,minimumSize=,preferredSize=],rootPaneCheckingEnabled=true]
      Trace:
      Start to wait frame "Frame with title "Test 4747962"" opened
      Trace:
      Frame "Frame with title "Test 4747962"" has been opened in 1 milliseconds
           javax.swing.JFrame[frame1,0,0,300x300,invalid,layout=java.awt.BorderLayout,title=Test
      4747962,resizable,normal,defaultCloseOperation=HIDE_ON_CLOSE,rootPane=javax.swing.JRootPane[,6,20,288x274,layout=javax.swing.JRootPane$RootLayout,alignmentX=0.0,alignmentY=0.0,border=,flags=449,maximumSize=,minimumSize=,preferredSize=],rootPaneCheckingEnabled=true]
      Trace:
      Start to wait dialog "Dialog with title "L2 dialog"" opened
      Test Failed
      ----------System.err:(15/760)----------
      Error:
      Dialog "Dialog with title "L2 dialog"" has not been opened in 60005 milliseconds
      java.lang.RuntimeException: Failed
           at Test4747962.main(Test4747962.java:97)
           at sun.reflect.NativeMethodAccessorImpl.invoke0(Native Method)
           at sun.reflect.NativeMethodAccessorImpl.invoke(NativeMethodAccessorImpl.java:39)
           at sun.reflect.DelegatingMethodAccessorImpl.invoke(DelegatingMethodAccessorImpl.java:25)
           at java.lang.reflect.Method.invoke(Method.java:324)
           at com.sun.javatest.regtest.MainWrapper$MainThread.run(MainWrapper.java:82)
           at java.lang.Thread.run(Thread.java:559)

      JavaTest Message: Test threw exception: java.lang.RuntimeException: Failed
      JavaTest Message: shutting down test

      STATUS:Failed.`main' threw exception: java.lang.RuntimeException: Failed
      result: Failed. Execution failed: `main' threw exception: java.lang.RuntimeException: Failed


      test result: Failed. Execution failed: `main' threw exception: java.lang.RuntimeException: Failed


      Specific machine info:
      ======================
      Hostname: linux-24
      OS: RedHat Advanced Server 2.1 (Gnome)


      ======================================================================

        Attachments

          Issue Links

            Activity

              People

              • Assignee:
                asaha Abhijit Saha
                Reporter:
                akmsunw Akm Akm (Inactive)
              • Votes:
                0 Vote for this issue
                Watchers:
                0 Start watching this issue

                Dates

                • Created:
                  Updated:
                  Resolved:
                  Imported:
                  Indexed: