Uploaded image for project: 'JDK'
  1. JDK
  2. JDK-4966164

Regression-test java/awt/Window/NoResizeEvent/NoResizeEvent.java fails

    XMLWordPrintable

    Details

    • Subcomponent:
    • Resolved In Build:
      b35
    • CPU:
      x86, sparc
    • OS:
      solaris_9, solaris_10
    • Verification:
      Verified

      Description



      Name: kaR10181 Date: 12/10/2003


      Filed By : J2SE-SQA [###@###.###
      JDK : JDK1.5.0-b30
      Testbase : Regression-test
      Platform[s] : Solaris 9 (sparc) (CDE), Solaris 10 (x86) (GNOME)
      switch/Mode : -client, -d64
      Falling test[s]:
               java/awt/Window/NoResizeEvent/NoResizeEvent.java

      Regression-test java/awt/Window/NoResizeEvent/NoResizeEvent.java test fails with JDK1.5.0-b30
      The test passes on Windows XP. The test is absent in prvious versions of regression testbase.

      Test source location:
      =====================
      /java/re/jdk/1.5.0/promoted/latest/ws/j2se/test/java/awt/Window/NoResizeEvent/NoResizeEvent.java

      jtr file location:
      ==================
      /net/jtgb4u4c.sfbay/export/sail15/results.2/tiger/b30/regtest/x86/sol10_x86_gnome_linux-18/workDir/test/java/awt/Window/NoResizeEvent/NoResizeEvent.jtr

      How to reproduce:
      =================
      Run the following script (you may need to change its variables)

      --- script start ---
      #!/bin/sh
      RESULT_DIR=`pwd`
      WORK_DIR=$RESULT_DIR/workDir/test
      REPORT_DIR=$RESULT_DIR/reportDir

      #Paths in Java Software:
      JT_HOME="/java/re/jct-tools/3.1.2/archive/fcs/binaries"
      JEMMY_JAR="/net/jdk/export/jpse04/Jemmy/jemmy.jar"
      JAVA_HOME="/java/re/jdk/1.5.0/promoted/all/b30/binaries/solaris-i586"
      TEST_BASE_PATH="/java/re/jdk/1.5.0/promoted/all/b30/ws/j2se/test"

      #Alternative paths outside Java Software:
      #JT_HOME="/net/koori.sfbay/onestop/jct-tools/3.1.2/archive/fcs/binaries"
      #JEMMY_JAR="/net/jdk/export/jpse04/Jemmy/jemmy.jar"
      #JAVA_HOME="/net/koori.sfbay/onestop/jdk/1.5.0/promoted/all/b30/binaries/solaris-i586"
      #TEST_BASE_PATH="/net/koori.sfbay/onestop/jdk/1.5.0/promoted/all/b30/ws/j2se/test"

      #Alternative paths for the NSK site:
      #JT_HOME="/net/linux-15/export/home/java/jct"
      #JEMMY_JAR="$JT_HOME/jemmy/jemmy.jar"
      #JAVA_HOME="/net/linux-15/export/home/java/jdk1.5.0/x86"
      #TEST_BASE_PATH="/net/linux-15/export/home/java/regtest.tiger/test"


      TESTVMOPTS="-client"
      CLASSPATH="$JT_HOME/classes:$JT_HOME/lib/javatest.jar:$JT_HOME/lib/jtreg.jar"

      TEST="java/awt/Window/NoResizeEvent/NoResizeEvent.java"

      mkdir -p $WORK_DIR/scratch 2>&1
      mkdir -p $WORK_DIR/jtData 2>&1
      mkdir -p $REPORT_DIR 2>&1

      #rm $WORK_DIR/jtData/ResultCache.jtw 2>&1

      cd $WORK_DIR/scratch

      $JAVA_HOME/bin/java -server -cp $CLASSPATH -DenvVars=TESTJAVAHOME=$JAVA_HOME,TESTVMOPTS=$TESTVMOPTS,DISPLAY=:0,HOME=$HOME/.regtest,PATH=/bin:/usr/bin,CPAPPEND=$JEMMY_JAR,TZ=,LC_ALL=en_US,LC_CTYPE=en_US,LANG=en_US,LPDEST= -DDISPLAY=:0 -DlocalHost="linux-18" -Dprogram=jtreg com.sun.javatest.regtest.Main -a -v default -batch -params -w "$WORK_DIR" -r "$REPORT_DIR" -t "$TEST_BASE_PATH" "$TEST_BASE_PATH/$TEST"

      --- script end ---

      Script output:
      ==============

      Test output (jtr part):
      =======================
      ----------System.out:(6/280)----------
      Any messages for the tester will display here.
      Any messages for the tester will display here.
      The test failed: Resize event arrived: 3 times.
      The test failed: Resize event arrived: 3 times.
      The test is over, hit Ctl-C to stop Java VM
      The test is over, hit Ctl-C to stop Java VM
      ----------System.err:(19/1074)----------
      java.awt.event.ComponentEvent[COMPONENT_RESIZED (19,0 12x31)] on frame0
      java.awt.event.ComponentEvent[COMPONENT_RESIZED (19,0 12x31)] on frame0
      java.awt.event.ComponentEvent[COMPONENT_RESIZED (19,0 12x31)] on frame0
      Resize count: 3
      java.lang.RuntimeException: Resize event arrived: 3 times.
           at NoResizeEvent.fail(NoResizeEvent.java:240)
           at NoResizeEvent.init(NoResizeEvent.java:81)
           at NoResizeEvent.main(NoResizeEvent.java:166)
           at sun.reflect.NativeMethodAccessorImpl.invoke0(Native Method)
           at sun.reflect.NativeMethodAccessorImpl.invoke(NativeMethodAccessorImpl.java:39)
           at sun.reflect.DelegatingMethodAccessorImpl.invoke(DelegatingMethodAccessorImpl.java:25)
           at java.lang.reflect.Method.invoke(Method.java:489)
           at com.sun.javatest.regtest.MainWrapper$MainThread.run(MainWrapper.java:82)
           at java.lang.Thread.run(Thread.java:565)

      JavaTest Message: Test threw exception: java.lang.RuntimeException: Resize event arrived: 3 times.
      JavaTest Message: shutting down test

      STATUS:Failed.`main' threw exception: java.lang.RuntimeException: Resize event arrived: 3 times.
      result: Failed. Execution failed: `main' threw exception: java.lang.RuntimeException: Resize event arrived: 3 times.


      test result: Failed. Execution failed: `main' threw exception: java.lang.RuntimeException: Resize event arrived: 3 times.


      Specific machine info:
      ======================
      Hostname: linux-18
      OS: Solaris 10 (x86) (GNOME)
      Hostname: novo48
      OS: Solaris 9 (sparc) (CDE)



      ======================================================================

        Attachments

          Activity

            People

            Assignee:
            ant Anton Tarasov
            Reporter:
            akmsunw Akm Akm (Inactive)
            Votes:
            0 Vote for this issue
            Watchers:
            0 Start watching this issue

              Dates

              Created:
              Updated:
              Resolved:
              Imported:
              Indexed: