Uploaded image for project: 'JDK'
  1. JDK
  2. JDK-4973002

REGRESSION: Regression test .../PageDimension/Printing.java fails

    Details

    • Subcomponent:
      2d
    • CPU:
      x86
    • OS:
      linux, windows_98

      Description



      Name: vsR10238 Date: 12/28/2003


      Filed By : J2SE-SQA [###@###.###
      JDK : JDK1.5.0-b32
      Testbase : Regression-test
      Platform[s] : all
      switch/Mode : -client, -server
      Falling test[s]:
               java/awt/PrintJob/PageDimension/Printing.java

      Regression test java/awt/PrintJob/PageDimension/Printing.java test fails using JDK1.5.0-b32 on all platforms.

      The test fails using JDK1.5.0-b32 on the following OSes:

      RH Linux 9.0
      RH Linux 2.1 AS
      Solaris 10 x86
      Solaris 9 Sparc
      Solaris 10 Sparc
      Windows XP
      Windows 2000
      Windows 98

      On all these OSes the same test passes using JDK1.5.0-b31, JDK1.4.2-b28.

      The test passed with JDK1.5.0-b32 on the following OSes:

      RH Linux 7.3
      Mercury (Sun Java Desktop System 2003)

      Test source location:
      =====================
      /java/re/jdk/1.5.0/promoted/all/b32/ws/j2se/test/java/awt/PrintJob/PageDimension/Printing.java

      jtr file location:
      ==================
      /net/jtgb4u4c.sfbay/export/sail15/results.2/tiger/b32/regtest/linux/redhat9.0_gnome_smp_linux-22/workDir/test/java/awt/PrintJob/PageDimension/Printing.jtr

      How to reproduce:
      =================
      Run the following script (you may need to change its variables)

      --- script start ---
      #!/bin/sh
      RESULT_DIR=`pwd`
      WORK_DIR=$RESULT_DIR/workDir/test
      REPORT_DIR=$RESULT_DIR/reportDir

      #Paths in Java Software:
      JT_HOME="/java/re/jct-tools/3.1.2/archive/fcs/binaries"
      JEMMY_JAR="/net/jdk/export/jpse04/Jemmy/jemmy.jar"
      JAVA_HOME="/java/re/jdk/1.5.0/promoted/all/b32/binaries/linux-i586"
      TEST_BASE_PATH="/java/re/jdk/1.5.0/promoted/all/b32/ws/j2se/test"

      #Alternative paths outside Java Software:
      #JT_HOME="/net/koori.sfbay/onestop/jct-tools/3.1.2/archive/fcs/binaries"
      #JEMMY_JAR="/net/jdk/export/jpse04/Jemmy/jemmy.jar"
      #JAVA_HOME="/net/koori.sfbay/onestop/jdk/1.5.0/promoted/all/b32/binaries/linux-i586"
      #TEST_BASE_PATH="/net/koori.sfbay/onestop/jdk/1.5.0/promoted/all/b32/ws/j2se/test"

      #Alternative paths for the NSK site:
      #JT_HOME="/net/linux-15/export/home/java/jct"
      #JEMMY_JAR="$JT_HOME/jemmy/jemmy.jar"
      #JAVA_HOME="/net/linux-15/export/home/java/jdk1.5.0/linux"
      #TEST_BASE_PATH="/net/linux-15/export/home/java/regtest.tiger/test"


      TESTVMOPTS="-client"
      CLASSPATH="$JT_HOME/classes:$JT_HOME/lib/javatest.jar:$JT_HOME/lib/jtreg.jar"

      TEST="java/awt/PrintJob/PageDimension/Printing.java"

      mkdir -p $WORK_DIR/scratch 2>&1
      mkdir -p $WORK_DIR/jtData 2>&1
      mkdir -p $REPORT_DIR 2>&1

      #rm $WORK_DIR/jtData/ResultCache.jtw 2>&1

      cd $WORK_DIR/scratch

      $JAVA_HOME/bin/java -server -cp $CLASSPATH -DenvVars=TESTJAVAHOME=$JAVA_HOME,TESTVMOPTS=$TESTVMOPTS,DISPLAY=:0,HOME=$HOME/.regtest,PATH=/bin:/usr/bin,CPAPPEND=$JEMMY_JAR,TZ=,LC_ALL=en_US,LC_CTYPE=en_US,LANG=en_US,LPDEST= -DDISPLAY=:0 -DlocalHost="linux-22" -Dprogram=jtreg com.sun.javatest.regtest.Main -a -v default -batch -params -w "$WORK_DIR" -r "$REPORT_DIR" -t "$TEST_BASE_PATH" "$TEST_BASE_PATH/$TEST"

      --- script end ---

      Script output:
      ==============

      Test output (jtr part):
      =======================
      ----------System.out:(3/282)----------
      This test is to verify that the getPageDimension and getPageResolution methods
        return appropriate values.
        Test Failed :::When the paper is set to iso-a0 it is not giving the correct page dimensions -- expected: 33.1101x46.4959 actual: java.awt.Dimension[width=2376,height=3384]
      ----------System.err:(15/755)----------
      java.lang.RuntimeException: Test Failed
      at Printing.test(Printing.java:53)
      at Printing.<init>(Printing.java:29)
      at Printing.main(Printing.java:24)
      at sun.reflect.NativeMethodAccessorImpl.invoke0(Native Method)
      at sun.reflect.NativeMethodAccessorImpl.invoke(NativeMethodAccessorImpl.java:39)
      at sun.reflect.DelegatingMethodAccessorImpl.invoke(DelegatingMethodAccessorImpl.java:25)
      at java.lang.reflect.Method.invoke(Method.java:494)
      at com.sun.javatest.regtest.MainWrapper$MainThread.run(MainWrapper.java:82)
      at java.lang.Thread.run(Thread.java:566)

      JavaTest Message: Test threw exception: java.lang.RuntimeException: Test Failed
      JavaTest Message: shutting down test

      STATUS:Failed.`main' threw exception: java.lang.RuntimeException: Test Failed
      result: Failed. Execution failed: `main' threw exception: java.lang.RuntimeException: Test Failed


      test result: Failed. Execution failed: `main' threw exception: java.lang.RuntimeException: Test Failed


      Specific machine info:
      ======================
      Hostname: linux-17
      OS: Windows 98
      Hostname: linux-22
      OS: RedHat Linux 9.0 (GNOME)



      ======================================================================

        Attachments

          Issue Links

            Activity

              People

              • Assignee:
                jgodinez Jennifer Godinez (Inactive)
                Reporter:
                vshsunw Vsh Vsh (Inactive)
              • Votes:
                0 Vote for this issue
                Watchers:
                0 Start watching this issue

                Dates

                • Created:
                  Updated:
                  Resolved:
                  Imported:
                  Indexed: