Uploaded image for project: 'JDK'
  1. JDK
  2. JDK-4990024

Bigapp Vmark and Vtest received test failure

    Details

    • Subcomponent:
    • CPU:
      x86
    • OS:
      windows_2003

      Description

      After running Bigapp's Volano Mark or Volano Test with jdk1.4.2_04-b03 or the fcs build on 32 bit Windows 2003 Enterpise Edition, all the tests processes got killed and failure messages were received, even though they were run with -XX:+ShowMessageBoxOnError flag. But these tests were passed with jdk1.4.2_04-b01 on Windows 2000 Advanced Server.

      Please contact me for the machine information, thank you.

      Here is the log file with the error messages:
      Mark4 in Room7 disconnected from server.
      [Mon Feb 02 16:59:19 PST 2004] Error reading from 10.5.20.188. (java.net.SocketException: Connection reset)
      [Mon Feb 02 16:59:19 PST 2004] Error reading from 10.5.20.188. (java.net.SocketException: Connection reset)
      [Mon Feb 02 16:59:19 PST 2004] Error reading from 10.5.20.188. (java.net.SocketException: Connection reset)
      Mark8 in Room2 disconnected from server.
      [Mon Feb 02 16:59:19 PST 2004] Error reading from 10.5.20.188. (java.net.SocketException: Connection reset)
      Mark19 in Room2 disconnected from server.
      Mark10 in Room2 disconnected from server.
      Mark18 in Room3 disconnected from server.
      Mark14 in Room6 disconnected from server.
      Mark10 in Room9 disconnected from server.
      Mark4 in Room6 disconnected from server.
      Mark14 in Room4 disconnected from server.
      Mark8 in Room8 disconnected from server.
      Mark12 in Room7 disconnected from server.
      Mark18 in Room4 disconnected from server.
      Mark16 in Room6 disconnected from server.
      Mark12 in Room1 disconnected from server.
      Mark4 in Room2 disconnected from server.
      Mark12 in Room9 disconnected from server.
      Mark10 in Room8 disconnected from server.
      Mark14 in Room3 disconnected from server.
      Mark20 in Room2 disconnected from server.
      Mark12 in Room5 disconnected from server.
      Test failed.

        Attachments

          Issue Links

            Activity

              People

              • Assignee:
                poonam Poonam Bajaj Parhar
                Reporter:
                ltansunw Li Tan (Inactive)
              • Votes:
                0 Vote for this issue
                Watchers:
                1 Start watching this issue

                Dates

                • Created:
                  Updated:
                  Resolved:
                  Imported:
                  Indexed: