Uploaded image for project: 'JDK'
  1. JDK
  2. JDK-5010570

linux-ia64 RE nightly build failed during pack/unpack

    Details

    • Subcomponent:
      gc
    • Resolved In Build:
      b43
    • CPU:
      itanium
    • OS:
      linux_redhat_2.1

      Description

      linux-ia64 RE nightly build failed during pack/unpack. This build was performed on a dual processor Itanium 2 machine, the error message is:

      ...
      gnumake[3]: Entering directory `/BUILD_AREA/jdk1.5.0/install/make/pack'
      /bin/mkdir -p /BUILD_AREA/jdk1.5.0/control/build/linux-ia64/pack/pack-jre-jars
      for i in lib/rt.jar lib/jsse.jar lib/charsets.jar lib/ext/localedata.jar ; do /bin/ls -l /BUILD_AREA/jdk1.5.0/control/build/linux-ia64/j2re-image/$i | /usr/bin/gawk '{printf("Packing %s %s bytes\n",$9, $5)}' ; /bin/mkdir -p /BUILD_AREA/jdk1.5.0/control/build/linux-ia64/pack/pack-jre-jars/`/usr/bin/dirname $i` ; /bin/mkdir -p /BUILD_AREA/jdk1.5.0/control/build/linux-ia64/j2re-image/`/usr/bin/dirname $i` ; /BUILD_AREA/jdk1.5.0/control/build/linux-ia64/bin/pack200 -J-Xmx1024m -J-esa -J-ea "--no-gzip" "--config-file=pack.all.properties" "--config-file=pack.64.properties" --strip-debug /BUILD_AREA/jdk1.5.0/control/build/linux-ia64/pack/pack-jre-jars/`/usr/bin/dirname $i`/`/bin/basename $i .jar`.pack /BUILD_AREA/jdk1.5.0/control/build/linux-ia64/j2re-image/$i || exit 1 ; rm -f /BUILD_AREA/jdk1.5.0/control/build/linux-ia64/j2re-image/$i ; /BUILD_AREA/jdk1.5.0/control/build/linux-ia64/bin/unpack200 /BUILD_AREA/jdk1.5.0/control/build/linux-ia64/pack/pack-jre-jars/`/usr/bin/dirname $i`/`/bin/basename $i .jar`.pack /BUILD_AREA/jdk1.5.0/control/build/linux-ia64/j2re-image/$i || exit 1 ; done
      Packing /BUILD_AREA/jdk1.5.0/control/build/linux-ia64/j2re-image/lib/rt.jar 38759730 bytes
      Exception in thread "main" gnumake[3]: *** [pack-jars] Error 1
      gnumake[3]: Leaving directory `/BUILD_AREA/jdk1.5.0/install/make/pack'
      gnumake[2]: *** [pack-jre] Error 2
      gnumake[2]: Leaving directory `/BUILD_AREA/jdk1.5.0/install/make/pack'
      gnumake[1]: *** [all] Error 1
      gnumake[1]: Leaving directory `/BUILD_AREA/jdk1.5.0/install/make'
      gnumake: *** [install-build] Error 2

      Please see the following URL for complete log file:

      http://koori.sfbay/java/re/j2se/1.5.0/nightly/logs/build-linux-ia64.log

        Attachments

          Activity

            People

            • Assignee:
              jmasa Jon Masamitsu (Inactive)
              Reporter:
              duke J. Duke (Inactive)
            • Votes:
              0 Vote for this issue
              Watchers:
              5 Start watching this issue

              Dates

              • Created:
                Updated:
                Resolved:
                Imported:
                Indexed: