Uploaded image for project: 'JDK'
  1. JDK
  2. JDK-5028103

TEST_BUG: java/awt/Focus/ComponentLostFocusTest

    XMLWordPrintable

    Details

    • Subcomponent:
    • Resolved In Build:
      b51
    • CPU:
      x86
    • OS:
      linux, linux_redhat_2.1

      Description

      JAVA VERSION :
      ----------------
      java version "awt.pit-jcg-linux-02-2004-04-01-Thu.tiger"
      Java(TM) 2 Runtime Environment, Standard Edition (build awt.pit-jcg-linux-02-2004-04-01-Thu.tiger)
      Java HotSpot(TM) Client VM (build 1.5.0-beta2-b45, mixed mode)

      PLATFORM :
      ----------
      RedHat Advance Server 2.1
      javatestOS=Linux 2.4.9-e.24 (i386)
      javatestVersion=2.1.5

      Failed Test :
      -------------
      java/awt/Focus/ComponentLostFocusTest/ComponentLostFocusTest.html

      Test Location :
      ---------------
      jano.sfbay.sun.com:/java/jdk/ws/AWT/AWT-Tiger/test/java/awt/Focus/ComponentLostFocusTest

      JTR Location :
      ---------------
      Find attached with this bug.

      Steps to reproduce :-
      ---------------------
      1. set JTREG_HOME to the jtreg home directory.
      2. set JAVA_HOME to the PIT build 01-Apr-2004.
      3. Executing the command "jtreg -va -cpa:<classpath> ComponentLostFocusTest.html" throws

      java.lang.RuntimeException: Frame got no focus! Test failed.
      at ComponentLostFocusTest.start(ComponentLostFocusTest.java:56)
      at com.sun.javatest.regtest.AppletWrapper$AppletThread.run(AppletWrapper.java:145)
      at java.lang.Thread.run(Thread.java:570)

      STATUS:Failed.Applet thread threw exception: java.lang.RuntimeException: Frame got no focus! Test failed.
      result: Failed. Execution failed: Applet thread threw exception: java.lang.RuntimeException: Frame got no focus! Test failed.

        Attachments

          Issue Links

            Activity

              People

              Assignee:
              dcherepanov Dmitry Cherepanov
              Reporter:
              duke J. Duke (Inactive)
              Votes:
              0 Vote for this issue
              Watchers:
              0 Start watching this issue

                Dates

                Created:
                Updated:
                Resolved:
                Imported:
                Indexed: