Uploaded image for project: 'JDK'
  1. JDK
  2. JDK-5045985

Regression-cte CTE_REGTEST/Generic/4916752/Test4916752.sh fails

    Details

    • Subcomponent:
    • Resolved In Build:
      rc
    • CPU:
      sparc
    • OS:
      solaris_10
    • Verification:
      Verified

      Description

      Name: aaR10208 Date: 05/12/2004


      Filed By : J2SE-SQA [###@###.###
      JDK : JDK1.5.0-b50 (also failed with jdk1.4.2-fcs)
      Testbase : Regression-cte
      Platform[s] : Solaris 10-b55 (sparc) (GNOME)
      switch/Mode : generic
      Falling test[s]: CTE_REGTEST/Generic/4916752/Test4916752.sh

      Regression-cte CTE_REGTEST/Generic/4916752/Test4916752.sh test fails with JDK1.5.0-b50.

      Test source location:
      =====================
      /net/jdk/export/jpse04/Regression/1.5.0/test/CTE_REGTEST/Generic/4916752/Test4916752.sh

      jtr file location:
      ==================
      /net/jtgb4u4c.sfbay/export/sail15/results.2/tiger/b50/regtest/sparc/Solaris_10_sparc_GNOME__linux-8/workDir/cte/CTE_REGTEST/Generic/4916752/Test4916752.jtr

      How to reproduce:
      =================
      Run the following script (you may need to change its variables)

      --- script start ---
      #!/bin/sh
      RESULT_DIR=`pwd`
      WORK_DIR=$RESULT_DIR/workDir/test
      REPORT_DIR=$RESULT_DIR/reportDir

      #Paths in Java Software:
      JT_HOME="/java/re/jct-tools/3.1.2/archive/fcs/binaries"
      JEMMY_JAR="/net/jdk.sfbay/export/jpse04/Jemmy/jemmy.jar"
      JAVA_HOME="/java/re/jdk/1.5.0/promoted/all/b50/binaries/solaris-sparc"
      TEST_BASE_PATH="/net/jdk/export/jpse04/Regression/1.5.0/test"

      #Alternative paths outside Java Software
      #JT_HOME="/net/koori.sfbay/onestop/jct-tools/3.1.2/archive/fcs/binaries"
      #JEMMY_JAR="/net/jdk.sfbay/export/jpse04/Jemmy/jemmy.jar"
      #JAVA_HOME="/net/koori.sfbay/onestop/jdk/1.5.0/promoted/all/b50/binaries/solaris-sparc"
      #TEST_BASE_PATH="/net/jdk/export/jpse04/Regression/1.5.0/test"

      #Alternative paths for the NSK site:
      #JT_HOME="/net/linux-15/export/home/java/jct"
      #JEMMY_JAR="$JT_HOME/jemmy/jemmy.jar"
      #JAVA_HOME="/net/linux-15/export/home/java/jdk1.5.0/sparc"
      #TEST_BASE_PATH="/net/linux-15/export/home/java/regtest.tiger/cte"


      TESTVMOPTS="-client"
      CLASSPATH="$JT_HOME/classes:$JT_HOME/lib/javatest.jar:$JT_HOME/lib/jtreg.jar"

      TEST="CTE_REGTEST/Generic/4916752/Test4916752.sh"

      mkdir -p $WORK_DIR/scratch 2>&1
      mkdir -p $WORK_DIR/jtData 2>&1
      mkdir -p $REPORT_DIR 2>&1

      #rm $WORK_DIR/jtData/ResultCache.jtw 2>&1

      cd $WORK_DIR/scratch

      $JAVA_HOME/bin/java -showversion -server -cp $CLASSPATH -DenvVars=TESTJAVAHOME=$JAVA_HOME,TESTVMOPTS=$TESTVMOPTS,DISPLAY=$DISPLAY,HOME=$HOME/.regtest,PATH=/bin:/usr/bin,CPAPPEND=$JEMMY_JAR,TZ=,LC_ALL=en_US,LC_CTYPE=en_US,LANG=en_US,LPDEST= -DDISPLAY=$DISPLAY -DlocalHost=`uname -n` -Dprogram=jtreg com.sun.javatest.regtest.Main -v default -batch -params -w "$WORK_DIR" -r "$REPORT_DIR" -t "$TEST_BASE_PATH" "$TEST_BASE_PATH/$TEST"

      --- script end ---

      Test output (jtr part):
      =======================
      ----------System.out:(30/2501)----------
      org.omg.CORBA.COMM_FAILURE: vmcid: SUN minor code: 201 completed: No
      at com.sun.corba.se.impl.logging.ORBUtilSystemException.connectFailure(ORBUtilSystemException.java:1711)
      at com.sun.corba.se.impl.logging.ORBUtilSystemException.connectFailure(ORBUtilSystemException.java:1729)
      at com.sun.corba.se.impl.transport.SocketOrChannelConnectionImpl.<init>(SocketOrChannelConnectionImpl.java:197)
      at com.sun.corba.se.impl.transport.SocketOrChannelConnectionImpl.<init>(SocketOrChannelConnectionImpl.java:208)
      at com.sun.corba.se.impl.transport.SocketOrChannelContactInfoImpl.createConnection(SocketOrChannelContactInfoImpl.java:97)
      at com.sun.corba.se.impl.protocol.CorbaClientRequestDispatcherImpl.beginRequest(CorbaClientRequestDispatcherImpl.java:152)
      at com.sun.corba.se.impl.protocol.CorbaClientDelegateImpl.request(CorbaClientDelegateImpl.java:118)
      at com.sun.corba.se.impl.resolver.BootstrapResolverImpl.invoke(BootstrapResolverImpl.java:75)
      at com.sun.corba.se.impl.resolver.BootstrapResolverImpl.resolve(BootstrapResolverImpl.java:108)
      at com.sun.corba.se.impl.resolver.CompositeResolverImpl.resolve(CompositeResolverImpl.java:22)
      at com.sun.corba.se.impl.resolver.CompositeResolverImpl.resolve(CompositeResolverImpl.java:22)
      at com.sun.corba.se.impl.resolver.CompositeResolverImpl.resolve(CompositeResolverImpl.java:22)
      at com.sun.corba.se.impl.orb.ORBImpl.resolve_initial_references(ORBImpl.java:1153)
      at server4916752.main(server4916752.java:31)
      Caused by: java.net.ConnectException: Connection refused
      at sun.nio.ch.Net.connect(Native Method)
      at sun.nio.ch.SocketChannelImpl.connect(SocketChannelImpl.java:464)
      at java.nio.channels.SocketChannel.open(SocketChannel.java:146)
      at com.sun.corba.se.impl.transport.SocketOrChannelConnectionImpl.<init>(SocketOrChannelConnectionImpl.java:177)
      ... 11 more
      HelloServer exiting !
      at com.sun.corba.se.impl.logging.ORBUtilSystemException.connectFailure(ORBUtilSystemException.java:1711)
      at com.sun.corba.se.impl.logging.ORBUtilSystemException.connectFailure(ORBUtilSystemException.java:1729)
      Caused by: java.net.ConnectException: Connection refused
      Exception in thread "main" org.omg.CORBA.COMM_FAILURE: vmcid: SUN minor code: 201 completed: No
      at com.sun.corba.se.impl.logging.ORBUtilSystemException.connectFailure(ORBUtilSystemException.java:1711)
      at com.sun.corba.se.impl.logging.ORBUtilSystemException.connectFailure(ORBUtilSystemException.java:1729)
      Caused by: java.net.ConnectException: Connection refused
      Test Failed
      ----------System.err:(28/2167)----------
      Note: HelloPOA.java uses unchecked or unsafe operations.
      Note: Recompile with -Xlint:unchecked for details.
      May 6, 2004 8:44:47 PM com.sun.corba.se.impl.transport.SocketOrChannelConnectionImpl <init>
      WARNING: ORBUTIL.connectFailure
      org.omg.CORBA.COMM_FAILURE: vmcid: SUN minor code: 201 completed: No
      at com.sun.corba.se.impl.logging.ORBUtilSystemException.connectFailure(ORBUtilSystemException.java:1711)
      at com.sun.corba.se.impl.logging.ORBUtilSystemException.connectFailure(ORBUtilSystemException.java:1729)
      at com.sun.corba.se.impl.transport.SocketOrChannelConnectionImpl.<init>(SocketOrChannelConnectionImpl.java:197)
      at com.sun.corba.se.impl.transport.SocketOrChannelConnectionImpl.<init>(SocketOrChannelConnectionImpl.java:208)
      at com.sun.corba.se.impl.transport.SocketOrChannelContactInfoImpl.createConnection(SocketOrChannelContactInfoImpl.java:97)
      at com.sun.corba.se.impl.protocol.CorbaClientRequestDispatcherImpl.beginRequest(CorbaClientRequestDispatcherImpl.java:152)
      at com.sun.corba.se.impl.protocol.CorbaClientDelegateImpl.request(CorbaClientDelegateImpl.java:118)
      at com.sun.corba.se.impl.resolver.BootstrapResolverImpl.invoke(BootstrapResolverImpl.java:75)
      at com.sun.corba.se.impl.resolver.BootstrapResolverImpl.resolve(BootstrapResolverImpl.java:108)
      at com.sun.corba.se.impl.resolver.CompositeResolverImpl.resolve(CompositeResolverImpl.java:22)
      at com.sun.corba.se.impl.resolver.CompositeResolverImpl.resolve(CompositeResolverImpl.java:22)
      at com.sun.corba.se.impl.resolver.CompositeResolverImpl.resolve(CompositeResolverImpl.java:22)
      at com.sun.corba.se.impl.orb.ORBImpl.resolve_initial_references(ORBImpl.java:1153)
      at server4916752.main(server4916752.java:31)
      Caused by: java.net.ConnectException: Connection refused
      at sun.nio.ch.Net.connect(Native Method)
      at sun.nio.ch.SocketChannelImpl.connect(SocketChannelImpl.java:464)
      at java.nio.channels.SocketChannel.open(SocketChannel.java:146)
      at com.sun.corba.se.impl.transport.SocketOrChannelConnectionImpl.<init>(SocketOrChannelConnectionImpl.java:177)
      ... 11 more
      ERROR: org.omg.CORBA.COMM_FAILURE: vmcid: SUN minor code: 201 completed: No
      24183 Killed
      24181 Killed
      result: Failed. Execution failed: exit code 1



      Specific machine info:
      ======================
      Hostname: linux-8
      OS: Solaris 10 (sparc) (GNOME)



      ======================================================================

        Attachments

          Activity

            People

            • Assignee:
              asaha Abhijit Saha
              Reporter:
              sundrsunw Sundr Sundr (Inactive)
            • Votes:
              0 Vote for this issue
              Watchers:
              0 Start watching this issue

              Dates

              • Created:
                Updated:
                Resolved:
                Imported:
                Indexed: