Uploaded image for project: 'JDK'
  1. JDK
  2. JDK-5048933

REGRESSION: Regression-test javax/swing/JPopupMenu/4769039/bug4769039.java fails

    Details

      Description



      Name: aaR10208 Date: 05/18/2004


      Filed By : J2SE-SQA [###@###.###
      JDK : JDK1.5.0-b51 (passed with jdk1.4.2-fcs)
      Testbase : Regression-test
      Platform[s] : Solaris 8 (x86) (O/W)
      switch/Mode : generic
      Falling test[s]: javax/swing/JPopupMenu/4769039/bug4769039.java

      Regression-test javax/swing/JPopupMenu/4769039/bug4769039.java test fails with JDK1.5.0-b51 in
      OpenWindows environmen but passes with jdk1.4.2-fcs.
      The test's output differs from the output shown in bugid#4906721.
      Bugid #4906721 was closed as dupof 4902893 which is in the INT state since Oct. 2003. However,
      according to our comments in #4902893 the test was failing since at least Nov. 2003, so I'm
      filing this bug to raise the issue again.

      Test source location:
      =====================
      /java/re/jdk/1.5.0/promoted/all/b51/ws/j2se/test/javax/swing/JPopupMenu/4769039/bug4769039.java

      jtr file location:
      ==================
      /net/jtgb4u4c.sfbay/export/sail15/results.2/tiger/b51/regtest/x86/Solaris_8_x86_O_W__linux-10/workDir/test/javax/swing/JPopupMenu/4769039/bug4769039.jtr

      How to reproduce:
      =================
      Run the following script (you may need to change its variables)

      --- script start ---
      #!/bin/sh
      RESULT_DIR=`pwd`
      WORK_DIR=$RESULT_DIR/workDir/test
      REPORT_DIR=$RESULT_DIR/reportDir

      #Paths in Java Software:
      JT_HOME="/java/re/jct-tools/3.1.2/archive/fcs/binaries"
      JEMMY_JAR="/net/jdk.sfbay/export/jpse04/Jemmy/jemmy.jar"
      JAVA_HOME="/java/re/jdk/1.5.0/promoted/all/b51/binaries/solaris-i586"
      TEST_BASE_PATH="/java/re/jdk/1.5.0/promoted/all/b51/ws/j2se/test"

      #Alternative paths outside Java Software
      #JT_HOME="/net/koori.sfbay/onestop/jct-tools/3.1.2/archive/fcs/binaries"
      #JEMMY_JAR="/net/jdk.sfbay/export/jpse04/Jemmy/jemmy.jar"
      #JAVA_HOME="/net/koori.sfbay/onestop/jdk/1.5.0/promoted/all/b51/binaries/solaris-i586"
      #TEST_BASE_PATH="/net/koori.sfbay/onestop/jdk/1.5.0/promoted/all/b51/ws/j2se/test"

      #Alternative paths for the NSK site:
      #JT_HOME="/net/linux-15/export/home/java/jct"
      #JEMMY_JAR="$JT_HOME/jemmy/jemmy.jar"
      #JAVA_HOME="/net/linux-15/export/home/java/jdk1.5.0/x86"
      #TEST_BASE_PATH="/net/linux-15/export/home/java/regtest.tiger/test"


      TESTVMOPTS="-client"
      CLASSPATH="$JT_HOME/classes:$JT_HOME/lib/javatest.jar:$JT_HOME/lib/jtreg.jar"

      TEST="javax/swing/JPopupMenu/4769039/bug4769039.java"

      mkdir -p $WORK_DIR/scratch 2>&1
      mkdir -p $WORK_DIR/jtData 2>&1
      mkdir -p $REPORT_DIR 2>&1

      #rm $WORK_DIR/jtData/ResultCache.jtw 2>&1

      cd $WORK_DIR/scratch

      $JAVA_HOME/bin/java -showversion -server -cp $CLASSPATH -DenvVars=TESTJAVAHOME=$JAVA_HOME,TESTVMOPTS=$TESTVMOPTS,DISPLAY=$DISPLAY,HOME=$HOME/.regtest,PATH=/bin:/usr/bin,CPAPPEND=$JEMMY_JAR,TZ=,LC_ALL=en_US,LC_CTYPE=en_US,LANG=en_US,LPDEST= -DDISPLAY=$DISPLAY -DlocalHost=`uname -n` -Dprogram=jtreg com.sun.javatest.regtest.Main -v default -batch -params -w "$WORK_DIR" -r "$REPORT_DIR" -t "$TEST_BASE_PATH" "$TEST_BASE_PATH/$TEST"
      --- script end ---

      Test output (jtr part):
      =======================
      ----------System.out:(1/10)----------
      Equals!!!
      ----------System.err:(4/324)----------
      java.lang.RuntimeException: Test failed. Popup closes after VK_SPACE entering into JTextArea
      at bug4769039$RobotThread.run(bug4769039.java:95)
      at java.lang.Thread.run(Thread.java:595)
      STATUS:Failed.Applet thread threw exception: java.lang.RuntimeException: Test failed. Popup closes after VK_SPACE entering into JTextArea
      result: Failed. Execution failed: Applet thread threw exception: java.lang.RuntimeException: Test failed. Popup closes after VK_SPACE entering into JTextArea




      Specific machine info:
      ======================
      Hostname: linux-10
      OS: Solaris 8 (x86) (O/W, AutoInputFocus=True)



      ======================================================================

        Attachments

          Issue Links

            Activity

              People

              • Assignee:
                kizune Alexander Zuev
                Reporter:
                sundrsunw Sundr Sundr (Inactive)
              • Votes:
                0 Vote for this issue
                Watchers:
                0 Start watching this issue

                Dates

                • Created:
                  Updated:
                  Resolved:
                  Imported:
                  Indexed: