Uploaded image for project: 'JDK'
  1. JDK
  2. JDK-5086812

REGRESSION: javax/swing/plaf/basic/BasicHTML/4960629/bug4960629.java fails

    XMLWordPrintable

    Details

    • Subcomponent:
    • Introduced In Build:
      b01
    • Introduced In Version:
    • Resolved In Build:
      b42
    • CPU:
      generic, x86, sparc
    • OS:
      generic, linux_suse_sles_8.2, solaris_2.6, solaris_9
    • Verification:
      Verified

      Backports

        Description

        JDK : 1.5.0-beta-b63
            Platform[s] : Fails On: Solaris Sparc 9
            switch/Mode : Fails with: -d64
            Failing Test [s] : javax/swing/plaf/basic/BasicHTML/4960629


            Test source location:
            =====================
        /net/koori.sfbay/onestop/jdk/1.5.0/promoted/all/b63/ws/j2se/test/javax/swing/plaf/basic/BasicHTML/4960629


            jtr file location:
            ==================
        path:/net/jtgb4u4c/export/sail16/results.2/tiger/b63/regtest/sparc/solsparc9/workDir/test/net/cady/export/dtf/unified/results/tiger/b63/regression/solsparc9/workDir/javax/swing/plaf/basic/BasicHTML/4960629/bug4960629.jtr

            How to reproduce:
            ====================
            - Set JAVA_HOME to Tiger b63
            - cd /net/koori.sfbay/onestop/jdk/1.5.0/promoted/all/b63/ws/j2se/test/javax/swing/plaf/basic/BasicHTML/4960629
            - /net/koori.sfbay/onestop/jct-tools/2.1.6/archive/fcs/binaries/solaris/bin/jtreg -r:/tmp -w:/tmp .


            Test output:
            =============
         java.lang.RuntimeException: Test failed.
        at bug4960629.destroy(bug4960629.java:52)
        at com.sun.javatest.regtest.AppletWrapper$AppletThread.run(AppletWrapper.java:156)
        at java.lang.Thread.run(Thread.java:595)
        STATUS:Failed.Applet thread threw exception: java.lang.RuntimeException: Test failed.
        result: Failed. Execution failed: Applet thread threw exception: java.lang.RuntimeException: Test failed.




            Specific Machine Info:
            =====================
            Host Name: grus
            SunOS grus 5.9 Generic_112233-12 sun4u sparc SUNW,Ultra-60
                                    Solaris 9 4/04 s9s_u6wos_08a SPARC
                   Copyright 2004 Sun Microsystems, Inc. All Rights Reserved.
                                Use is subject to license terms.
                                     Assembled 22 March 2004

          Attachments

            Issue Links

              Activity

                People

                Assignee:
                mknyazevsunw Michael Knyazev (Inactive)
                Reporter:
                jaleesunw James Lee (Inactive)
                Votes:
                0 Vote for this issue
                Watchers:
                0 Start watching this issue

                  Dates

                  Created:
                  Updated:
                  Resolved:
                  Imported:
                  Indexed: