Uploaded image for project: 'JDK'
  1. JDK
  2. JDK-6298711

test/java/awt/dnd/ImageTransferTest failed

    XMLWordPrintable

    Details

    • Type: Bug
    • Status: Resolved
    • Priority: P4
    • Resolution: Fixed
    • Affects Version/s: 6
    • Fix Version/s: 6
    • Component/s: client-libs
    • Labels:
    • Subcomponent:
    • Resolved In Build:
      b47
    • CPU:
      generic
    • OS:
      generic

      Description

      #Test Results (version 2)
      #Tue Jul 19 18:10:48 MSD 2005
      #checksum:3ed5e0f9a80c0f24
      #-----testdescription-----
      $file=/export/ST/master/Mustang.AWT-master/test/java/awt/dnd/ImageTransferTest/ImageTransferTest.html
      $root=/export/ST/master/Mustang.AWT-master/test/java/awt
      author=###@###.### area=Clipboard
      keywords=bug4397404 othervm
      run=USER_SPECIFIED applet/othervm ImageTransferTest.html\n
      source=ImageTransferTest.html
      title=tests that images of all supported native image formats are transfered properly

      #-----environment-----

      #-----testresult-----
      description=file:///export/ST/master/Mustang.AWT-master/test/java/awt/dnd/ImageTransferTest/ImageTransferTest.html
      end=Tue Jul 19 18:10:48 MSD 2005
      environment=regtest
      execStatus=Failed. Execution failed: Applet thread threw exception: java.lang.RuntimeException: test failed: images in following native formats are not transferred properly: image/gif
      javatestOS=SunOS 5.8 (sparc)
      javatestVersion=2.1.6
      script=com.sun.javatest.regtest.RegressionScript
      sections=script_messages build compile applet
      start=Tue Jul 19 18:09:41 MSD 2005
      status=Failed. Execution failed: Applet thread threw exception: java.lang.RuntimeException: test failed: images in following native formats are not transferred properly: image/gif
      test=dnd/ImageTransferTest/ImageTransferTest.html
      work=/home/gas/bugs/test/ss/JTwork/dnd/ImageTransferTest

      #section:script_messages
      ----------messages:(4/228)----------
      JDK under test: (/net/piglet/export2/jdk-builds/JDK6.0/b42/solaris-sparc)
      java version "1.6.0-ea"
      Java(TM) 2 Runtime Environment, Standard Edition (build 1.6.0-ea-b42)
      Java HotSpot(TM) Server VM (build 1.6.0-ea-b42, mixed mode)

      #section:build
      ----------messages:(3/104)----------
      command: build ImageTransferTest
      reason: Named class compiled on demand
      elapsed time (seconds): 10.798
      result: Passed. Compilation successful

      #section:compile
      ----------messages:(3/195)----------
      command: compile /export/ST/master/Mustang.AWT-master/test/java/awt/dnd/ImageTransferTest/ImageTransferTest.java
      reason: .class file out of date or does not exist
      elapsed time (seconds): 10.795
      ----------System.out:(0/0)----------
      ----------System.err:(4/381)----------
      Note: /export/ST/master/Mustang.AWT-master/test/java/awt/dnd/ImageTransferTest/ImageTransferTest.java uses or overrides a deprecated API.
      Note: Recompile with -Xlint:deprecation for details.
      Note: /export/ST/master/Mustang.AWT-master/test/java/awt/dnd/ImageTransferTest/ImageTransferTest.java uses unchecked or unsafe operations.
      Note: Recompile with -Xlint:unchecked for details.
      result: Passed. Compilation successful

      #section:applet
      ----------messages:(3/144)----------
      command: applet ImageTransferTest.html
      reason: User specified action: run applet/othervm ImageTransferTest.html
      elapsed time (seconds): 55.221
      ----------System.out:(0/0)----------
      ----------System.err:(29/1145)----------
      Applet lost clipboard ownership
      Starting drag...
      Drop was successful=true
      Drop was successful=true
      Drop was successful=true
      Drop was successful=false
      Drop was successful=true
      Drop was successful=true
      ========= Child VM System.err ========
      getTransferData was successful
      format passed: image/png
      getTransferData was successful
      format passed: image/jpeg
      getTransferData was successful
      format passed: image/x-png
      getTransferData was successful
      different pixels: 0 ff7f7f00
      transferred image is different from initial image
      format failed: image/gif
      getTransferData was successful
      format passed: PNG
      getTransferData was successful
      format passed: JFIF
      ======================================
      java.lang.RuntimeException: test failed: images in following native formats are not transferred properly: image/gif
              at ImageTransferTest.start(ImageTransferTest.java:152)
              at com.sun.javatest.regtest.AppletWrapper$AppletThread.run(AppletWrapper.java:145)
              at java.lang.Thread.run(Thread.java:603)
      STATUS:Failed.Applet thread threw exception: java.lang.RuntimeException: test failed: images in following native formats are not transferred properly: image/gif
      result: Failed. Execution failed: Applet thread threw exception: java.lang.RuntimeException: test failed: images in following native formats are not transferred properly: image/gif


      test result: Failed. Execution failed: Applet thread threw exception: java.lang.RuntimeException: test failed: images in following native formats are not transferred properly: image/gif

      ###@###.### 2005-07-19 14:40:23 GMT

        Attachments

          Issue Links

            Activity

              People

              Assignee:
              agerasimsunw Alexander Gerasimov (Inactive)
              Reporter:
              agerasimsunw Alexander Gerasimov (Inactive)
              Votes:
              0 Vote for this issue
              Watchers:
              0 Start watching this issue

                Dates

                Created:
                Updated:
                Resolved:
                Imported:
                Indexed: