Uploaded image for project: 'JDK'
  1. JDK
  2. JDK-6345095

regression test EmptyClipRenderingTest fails

    Details

    • Subcomponent:
      2d
    • Resolved In Build:
      b44
    • CPU:
      x86, sparc
    • OS:
      windows_xp

      Backports

        Description

        Regression test test/sun/java2d/SunGraphics2D/EmptyClipRenderingTest.java
        fails on windows on 5.0 and mustang.

        The subtest which fails is on-screen rendering:
        java.lang.RuntimeException: Dest: Screen was rendered to at x=395 y=12 pixel=ffff0000
                at EmptyClipRenderingTest.testResult(EmptyClipRenderingTest.java:221)
                at EmptyClipRenderingTest.<init>(EmptyClipRenderingTest.java:48)
                at EmptyClipRenderingTest.main(EmptyClipRenderingTest.java:238)
        Exception in thread "main" java.lang.RuntimeException: Test FAILED: 1 subtest failures.
                at EmptyClipRenderingTest.<init>(EmptyClipRenderingTest.java:84)
                at EmptyClipRenderingTest.main(EmptyClipRenderingTest.java:238)

          Attachments

            Issue Links

              Activity

                People

                • Assignee:
                  serb Sergey Bylokhov
                  Reporter:
                  tdv Dmitri Trembovetski (Inactive)
                • Votes:
                  0 Vote for this issue
                  Watchers:
                  2 Start watching this issue

                  Dates

                  • Created:
                    Updated:
                    Resolved:
                    Imported:
                    Indexed: