Uploaded image for project: 'JDK'
  1. JDK
  2. JDK-6427496

test security/auth/x500/X500Principal/Parse.java failed on 150u8b1 but passed on previous 150u7b3

    XMLWordPrintable

    Details

      Description

      Test /javax/security/auth/x500/X500Principal/Parse.java from regresson j2se WS failed on 150u8b1 but passed on previous update 150u7b3

      - j2se regression WS (local WS was mergered with master location /net/jdk.sfbay/export/jpse04/Regression/1.5.0_j2se/ at 15th May'06)

      See attached files with results of execution for 150u8b1 and for 150u7b3

      java.lang.SecurityException: test 25 failed:
      expected 'cn=before\\0dafter,dc=example,dc=net'
      got 'cn=before\\0dafter,dc=#16076578616d706c65,dc=#16036e6574'
          at Parse.testName(Parse.java:175)
          at Parse.main(Parse.java:100)
          at sun.reflect.NativeMethodAccessorImpl.invoke0(Native Method)
          at sun.reflect.NativeMethodAccessorImpl.invoke(NativeMethodAccessorImpl.java:39)
          at sun.reflect.DelegatingMethodAccessorImpl.invoke(DelegatingMethodAccessorImpl.java:25)
          at java.lang.reflect.Method.invoke(Method.java:585)
          at com.sun.javatest.regtest.MainWrapper$MainThread.run(MainWrapper.java:83)
          at java.lang.Thread.run(Thread.java:595)

      JavaTest Message: Test threw exception: java.lang.SecurityException: test 25 failed:
      expected 'cn=before\\0dafter,dc=example,dc=net'
      got 'cn=before\\0dafter,dc=#16076578616d706c65,dc=#16036e6574'
      JavaTest Message: shutting down test

      STATUS:Failed.`main' threw exception: java.lang.SecurityException: test 25 failed: expected 'cn=before\\0dafter,dc=example,dc=net' got 'cn=before\\0dafter,dc=#16076578616d706c65,dc=#16036e6574'
      result: Failed. Execution failed: `main' threw exception: java.lang.SecurityException: test 25 failed: expected 'cn=before\0dafter,dc=example,dc=net' got 'cn=before\0dafter,dc=#16076578616d706c65,dc=#16036e6574'


      test result: Failed. Execution failed: `main' threw exception: java.lang.SecurityException: test 25 failed: expected 'cn=before\0dafter,dc=example,dc=net' got 'cn=before\0dafter,dc=#16076578616d706c65,dc=#16036e6574'


      To reproduce bugs
      use 1.5.0_8b1 JDK, run JTreg with appropriate JDK
      The used workspace is placed on /net/latte.ireland/deployment1/regtests/150_j2se
      the JTreg is placed on /net/latte.ireland/deployment1/sqe-tools2.1.6fcs
      to run please follow instructions http://jqa.ireland/procedures/test_procedures/141_test_procedures/RegressionTestExecution.html
      And add -automatic -bug:4505980

      Testing was on Solaris10 sparc
      tyrone% uname -a
      SunOS tyrone 5.10 Generic_118822-27 sun4u sparc SUNW,Sun-Blade-1000

      tyrone% cat /etc/release
                             Solaris 10 1/06 s10s_u1wos_19a SPARC
                 Copyright 2005 Sun Microsystems, Inc. All Rights Reserved.
                              Use is subject to license terms.
                                 Assembled 07 December 2005
      *** (#1 of 1): 2006-05-18 20:20:05 MSD ###@###.###

        Attachments

          Activity

            People

            Assignee:
            mullan Sean Mullan
            Reporter:
            edrobitk Eugene Drobitko (Inactive)
            Votes:
            0 Vote for this issue
            Watchers:
            0 Start watching this issue

              Dates

              Created:
              Updated:
              Resolved:
              Imported:
              Indexed: