Uploaded image for project: 'JDK'
  1. JDK
  2. JDK-6445355

java/awt/Choice/ChoiceHandleMouseEvent_2/ChoiceHandleMouseEven t_2.html fails

    XMLWordPrintable

    Details

    • Subcomponent:
    • Resolved In Build:
      b93
    • CPU:
      x86
    • OS:
      windows_xp
    • Verification:
      Verified

      Description

      JDK : Fails: Mustang b88
      Platform[s] : Fails On: Win XP Prof.
      Failing Test [s] : java/awt/Choice/ChoiceHandleMouseEvent_2/ChoiceHandleMouseEven t_2.html

          Test source location:
          =====================
      /net/cady/export/jdk1.6.0/promoted/all/b88/ws/j2se/test/java/awt/Choice/ChoiceHandleMouseEvent_2/ChoiceHandleMouseEven t_2.html

          jtr file location:
          ==================
      Please see attached jtr file.

          How to reproduce:
          ====================
          - Set JAVA_HOME to Mustang b88 windows-i586
          - cd /net/cady/export/jdk1.6.0/promoted/all/b88/ws/j2se/test/java/awt/Choice/ChoiceHandleMouseEvent_2
          - /net/koori.sfbay/onestop/jct-tools/2.1.6/archive/fcs/binaries/win32/bin/jtreg -r:/tmp -w:/tmp ./ChoiceHandleMouseEven t_2.html

          Test output:
          ============
      ----------System.out:(16/685)----------
      color got java.awt.Color[r=255,g=0,b=0]
      RED=java.awt.Color[r=255,g=0,b=0]
      Stage 1 passed. On Windows Choice shouldn't been closed if Mouse dragged outside of Choice after one mouse press 16
      Passed Stage 1: Choice should be closed if mouse dragged out.
      color got java.awt.Color[r=255,g=0,b=0]
      Stage 2 passed. On Windows Choice shouldn't been closed if Mouse dragged on its scrollbar 16
      Passed Stage 2: Choice should be be closed if LeftMouse drag finished on Scrollbar.
      x= 609
      y= 468
      color got java.awt.Color[r=255,g=0,b=0]
      RED=java.awt.Color[r=255,g=0,b=0]
      Stage 3 passed.16:8
      x= 609
      y= 468
      color got java.awt.Color[r=255,g=255,b=255]
      RED=java.awt.Color[r=255,g=0,b=0]
      ----------System.err:(5/582)----------
      java.lang.RuntimeException: Test failed. Exception thrown: java.lang.RuntimeException: Stage 3 failed. Choice is being closed with pressing button on its Scrollbar16:4
              at ChoiceHandleMouseEvent_2.start(ChoiceHandleMouseEvent_2.java:108)
              at com.sun.javatest.regtest.AppletWrapper$AppletThread.run(AppletWrapper.java:134)
              at java.lang.Thread.run(Thread.java:619)
      STATUS:Failed.Applet thread threw exception: java.lang.RuntimeException: Test failed. Exception thrown: java.lang.RuntimeException: Stage 3 failed. Choice is being closed with pressing button on its Scrollbar16:4
      result: Failed. Execution failed: Applet thread threw exception: java.lang.RuntimeException: Test failed. Exception thrown: java.lang.RuntimeException: Stage 3 failed. Choice is being closed with pressing button on its Scrollbar16:4

        Attachments

          Activity

            People

            Assignee:
            dav Andrei Dmitriev (Inactive)
            Reporter:
            jaleesunw James Lee (Inactive)
            Votes:
            0 Vote for this issue
            Watchers:
            0 Start watching this issue

              Dates

              Created:
              Updated:
              Resolved:
              Imported:
              Indexed: