Uploaded image for project: 'JDK'
  1. JDK
  2. JDK-6538523

openjdk b10 fastdebug build fails on Solaris Express with Sun C++ 5.8

    Details

    • Subcomponent:
    • Resolved In Build:
      b12
    • CPU:
      x86
    • OS:
      other

      Backports

        Description

        Compiler : /usr/bin/CC
        CC -V: CC: Sun C++ 5.8 Patch 121018-07 2006/11/01
        Platform : SunOS solaris-devx 5.11 snv_55b i86pc i386 i86pc

        CC -DSOLARIS -DSPARC_WORKS -DIA32 -DUSE_PRAGMA_IDENT_HDR -DUSE_PRAGMA_IDENT_SRC -DASSERT -DFASTDEBUG -DCHECK_UNHANDLED_OOPS -I../generated/adfiles -I../generated/jvmtifiles -I/export/home/openjdk/builds/b10/hotspot/src/share/vm/asm -I/export/home/openjdk/builds/b10/hotspot/src/share/vm/ci -I/export/home/openjdk/builds/b10/hotspot/src/share/vm/code -I/export/home/openjdk/builds/b10/hotspot/src/share/vm/compiler -I/export/home/openjdk/builds/b10/hotspot/src/share/vm/gc_implementation -I/export/home/openjdk/builds/b10/hotspot/src/share/vm/gc_implementation/concurrentMarkSweep -I/export/home/openjdk/builds/b10/hotspot/src/share/vm/gc_implementation/parallelScavenge -I/export/home/openjdk/builds/b10/hotspot/src/share/vm/gc_implementation/shared -I/export/home/openjdk/builds/b10/hotspot/src/share/vm/gc_interface -I/export/home/openjdk/builds/b10/hotspot/src/share/vm/interpreter -I/export/home/openjdk/builds/b10/hotspot/src/share/vm/libadt -I/export/home/openjdk/builds/b10/hotspot/src/share/vm/memory -I/export/home/openjdk/builds/b10/hotspot/src/share/vm/oops -I/export/home/openjdk/builds/b10/hotspot/src/share/vm/opto -I/export/home/openjdk/builds/b10/hotspot/src/share/vm/prims -I/export/home/openjdk/builds/b10/hotspot/src/share/vm/runtime -I/export/home/openjdk/builds/b10/hotspot/src/share/vm/services -I/export/home/openjdk/builds/b10/hotspot/src/share/vm/utilities -I/export/home/openjdk/builds/b10/hotspot/src/cpu/i486/vm -I/export/home/openjdk/builds/b10/hotspot/src/os/solaris/vm -I/export/home/openjdk/builds/b10/hotspot/src/os_cpu/solaris_i486/vm -I../generated -DHOTSPOT_BUILD_VERSION="\"1.7.0-ea-fastdebug-b10\"" -DHOTSPOT_BUILD_TARGET="\"fastdebug\"" -DHOTSPOT_BUILD_USER="\"openjdk\"" -DHOTSPOT_RELEASE_VERSION="\"1.7.0\"" -DHOTSPOT_VM_DISTRO="\"OpenJDK\"" -DCOMPILER2 -DSOLARIS_7_OR_LATER /export/home/openjdk/builds/b10/hotspot/src/os_cpu/solaris_i486/vm/solaris_i486.il -features=no%split_init -D_Crun_inline_placement -library=%none -KPIC -mt -xtarget=pentium -xO3 -g0 -DVM_LITTLE_ENDIAN -features=no%except -DDTRACE_ENABLED -c -o accessFlags.o /export/home/openjdk/builds/b10/hotspot/src/share/vm/utilities/accessFlags.cpp
        "/export/home/openjdk/builds/b10/hotspot/src/share/vm/utilities/exceptions.hpp", line 55: Error: Overloading ambiguity between "oop::operator!=(void*) const" and "operator!=(int, int)".
        "/export/home/openjdk/builds/b10/hotspot/src/share/vm/memory/genOopClosures.hpp", line 106: Error: Overloading ambiguity between "oop::operator!=(void*) const" and "operator!=(int, int)".
        "/export/home/openjdk/builds/b10/hotspot/src/share/vm/oops/klass.hpp", line 268: Error: Overloading ambiguity between "oop::operator==(void*) const" and "operator==(int, int)".
        "/export/home/openjdk/builds/b10/hotspot/src/share/vm/memory/universe.hpp", line 233: Error: Overloading ambiguity between "oop::operator!=(void*) const" and "operator!=(int, int)".
        "/export/home/openjdk/builds/b10/hotspot/src/share/vm/oops/klassVtable.hpp", line 140: Error: Overloading ambiguity between "oop::operator!=(void*) const" and "operator!=(int, int)".
        "/export/home/openjdk/builds/b10/hotspot/src/share/vm/oops/klassVtable.hpp", line 151: Error: Overloading ambiguity between "oop::operator!=(void*) const" and "operator!=(int, int)".
        "/export/home/openjdk/builds/b10/hotspot/src/share/vm/oops/cpCacheOop.hpp", line 112: Error: Overloading ambiguity between "oop::operator==(void*) const" and "operator==(int, int)".
        "/export/home/openjdk/builds/b10/hotspot/src/share/vm/oops/constantPoolOop.hpp", line 365: Error: Overloading ambiguity between "oop::operator==(void*) const" and "operator==(int, int)".
        "/export/home/openjdk/builds/b10/hotspot/src/share/vm/oops/constMethodOop.hpp", line 157: Error: Overloading ambiguity between "oop::operator!=(void*) const" and "operator!=(int, int)".
        "/export/home/openjdk/builds/b10/hotspot/src/share/vm/oops/constMethodOop.hpp", line 162: Error: Overloading ambiguity between "oop::operator!=(void*) const" and "operator!=(int, int)".
        "/export/home/openjdk/builds/b10/hotspot/src/share/vm/oops/instanceKlass.hpp", line 503: Error: Overloading ambiguity between "oop::operator==(void*) const" and "operator==(int, int)".
        "/export/home/openjdk/builds/b10/hotspot/src/share/vm/oops/instanceKlass.hpp", line 732: Error: Overloading ambiguity between "oop::operator==(void*) const" and "operator==(int, int)".
        "/export/home/openjdk/builds/b10/hotspot/src/share/vm/memory/vmSymbols.hpp", line 633: Error: Overloading ambiguity between "oop::operator!=(void*) const" and "operator!=(int, int)".
        "/export/home/openjdk/builds/b10/hotspot/src/share/vm/memory/vmSymbols.hpp", line 654: Error: Overloading ambiguity between "oop::operator!=(void*) const" and "operator!=(int, int)".
        "/export/home/openjdk/builds/b10/hotspot/src/share/vm/runtime/jniHandles.hpp", line 154: Error: Overloading ambiguity between "oop::operator!=(void*) const" and "operator!=(int, int)".
        "/export/home/openjdk/builds/b10/hotspot/src/share/vm/runtime/jniHandles.hpp", line 163: Error: Overloading ambiguity between "oop::operator==(void*) const" and "operator==(int, int)".
        "/export/home/openjdk/builds/b10/hotspot/src/share/vm/runtime/jniHandles.hpp", line 171: Error: Overloading ambiguity between "oop::operator!=(void*) const" and "operator!=(int, int)".
        "/export/home/openjdk/builds/b10/hotspot/src/share/vm/memory/concurrentMarkSweepGeneration.hpp", line 667: Error: Overloading ambiguity between "oop::operator==(void*) const" and "operator==(int, int)".
        "/export/home/openjdk/builds/b10/hotspot/src/share/vm/memory/cardTableModRefBS.hpp", line 252: Error: Overloading ambiguity between "oop::operator!=(void*) const" and "operator!=(int, int)".
        "/export/home/openjdk/builds/b10/hotspot/src/share/vm/services/lowMemoryDetector.hpp", line 119: Error: Overloading ambiguity between "oop::operator==(void*) const" and "operator==(int, int)".
        "/export/home/openjdk/builds/b10/hotspot/src/share/vm/gc_interface/collectedHeap.inline.hpp", line 24: Error: Overloading ambiguity between "oop::operator!=(void*) const" and "operator!=(int, int)".
        "/export/home/openjdk/builds/b10/hotspot/src/share/vm/gc_interface/collectedHeap.inline.hpp", line 25: Error: Overloading ambiguity between "oop::operator!=(void*) const" and "operator!=(int, int)".
        "/export/home/openjdk/builds/b10/hotspot/src/share/vm/gc_interface/collectedHeap.inline.hpp", line 41: Error: Overloading ambiguity between "oop::operator!=(void*) const" and "operator!=(int, int)".
        "/export/home/openjdk/builds/b10/hotspot/src/share/vm/gc_interface/collectedHeap.inline.hpp", line 42: Error: Overloading ambiguity between "oop::operator==(void*) const" and "operator==(int, int)".
        "/export/home/openjdk/builds/b10/hotspot/src/share/vm/gc_interface/collectedHeap.inline.hpp", line 43: Error: Overloading ambiguity between "oop::operator==(void*) const" and "operator==(int, int)".
        Compilation aborted, too many Error messages.
        make[8]: *** [accessFlags.o] Error 1
        make[8]: Leaving directory `/export/home/openjdk/builds/b10/control/build/solaris-i586-fastdebug/hotspot/outputdir/solaris_i486_compiler2/fastdebug'
        make[7]: *** [the_vm] Error 2
        make[7]: Leaving directory `/export/home/openjdk/builds/b10/control/build/solaris-i586-fastdebug/hotspot/outputdir/solaris_i486_compiler2/fastdebug'
        make[6]: *** [fastdebug] Error 2
        make[6]: Leaving directory `/export/home/openjdk/builds/b10/control/build/solaris-i586-fastdebug/hotspot/outputdir'
        make[5]: *** [generic_build2] Error 2
        make[5]: Leaving directory `/export/home/openjdk/builds/b10/hotspot/make'
        make[4]: *** [fastdebug] Error 2
        make[4]: Leaving directory `/export/home/openjdk/builds/b10/hotspot/make'
        make[3]: *** [hotspot-build] Error 2
        make[3]: Leaving directory `/export/home/openjdk/builds/b10/control/make'
        make[2]: *** [generic_debug_build] Error 2
        make[2]: Leaving directory `/export/home/openjdk/builds/b10/control/make'
        make[1]: *** [fastdebug_build] Error 2
        make[1]: Leaving directory `/export/home/openjdk/builds/b10/control/make'
        make: *** [dev-build] Error 2

          Attachments

            Issue Links

              Activity

                People

                • Assignee:
                  dholmes David Holmes
                  Reporter:
                  skonchad Sandeep Konchady
                • Votes:
                  0 Vote for this issue
                  Watchers:
                  3 Start watching this issue

                  Dates

                  • Created:
                    Updated:
                    Resolved:
                    Imported:
                    Indexed: