Uploaded image for project: 'JDK'
  1. JDK
  2. JDK-6594000

jkernel.dll build error on windows when VARIANT=DBG FASTDEBUG=true

    Details

    • Subcomponent:
    • Introduced In Build:
      b02
    • Introduced In Version:
      6u5
    • Resolved In Build:
      b02
    • CPU:
      x86
    • OS:
      windows
    • Verification:
      Not verified

      Description

      on windows, when doing fast debug build:

         Creating library f:/kernel/tmp/sun/sun.jkernel/jkernel/obj_gO/jkernel.lib and
       object f:/kernel/tmp/sun/sun.jkernel/jkernel/obj_gO/jkernel.exp
      jkernel.exp : warning LNK4070: /OUT:kernel.dll directive in .EXP differs from ou
      tput filename 'f:/kernel/tmp/sun/sun.jkernel/jkernel/obj_gO/jkernel.dll'; ignori
      ng directive
      kernel.obj : error LNK2001: unresolved external symbol "class ATL::CComModule _M
      odule" (?_Module@@3VCComModule@ATL@@A)
      DownloadDialog.obj : error LNK2001: unresolved external symbol "class ATL::CComM
      odule _Module" (?_Module@@3VCComModule@ATL@@A)
      DownloadHelper.obj : error LNK2001: unresolved external symbol "class ATL::CComM
      odule _Module" (?_Module@@3VCComModule@ATL@@A)
      f:/kernel/tmp/sun/sun.jkernel/jkernel/obj_gO/jkernel.dll : fatal error LNK1120:
      1 unresolved externals
      gnumake: *** [f:/kernel/bin/jkernel.dll] Error 1120

        Attachments

          Activity

            People

            • Assignee:
              ngthomas Thomas Ng (Inactive)
              Reporter:
              ngthomas Thomas Ng (Inactive)
            • Votes:
              0 Vote for this issue
              Watchers:
              0 Start watching this issue

              Dates

              • Created:
                Updated:
                Resolved:
                Imported:
                Indexed: