Uploaded image for project: 'JDK'
  1. JDK
  2. JDK-6733295

Build failed on Linux-i586 and Solaris-sparc,sparcv9,i586 for JDK 1.4.2_xx vista support fixes

    Details

    • Subcomponent:
    • Resolved In Build:
      b05
    • CPU:
      x86
    • OS:
      solaris_7

      Description

      Build failure for the following platforms.
      - Linux-i586
      - Solaris-sparc
      - Solaris-sparcv9
      - Solaris-i586

      Please backout the fix from both Master and Integration workspaces or fix this failure ASAP. Partial log files below.

      The remaining platforms passed.

      Thanks,
      Mong

      Partial log files:

      Linux-i586
      ===========

      Done with /BUILD_AREA/jdk142-update/ws/rev/hotspot/src/share/vm/memory/parGCAllocBuffer.cpp
      Compiling /BUILD_AREA/jdk142-update/ws/rev/hotspot/src/share/vm/code/pcDesc.cpp
      /BUILD_AREA/jdk142-update/ws/rev/hotspot/src/os/linux/vm/os_linux.cpp: In function `static void * os::dll_load(const char *, char *, int)':
      /BUILD_AREA/jdk142-update/ws/rev/hotspot/src/os/linux/vm/os_linux.cpp:858: `EM_X86_64' undeclared (first use this function)
      /BUILD_AREA/jdk142-update/ws/rev/hotspot/src/os/linux/vm/os_linux.cpp:858: (Each undeclared identifier is reported only once
      /BUILD_AREA/jdk142-update/ws/rev/hotspot/src/os/linux/vm/os_linux.cpp:858: for each function it appears in.)
      /BUILD_AREA/jdk142-update/ws/rev/hotspot/src/os/linux/vm/os_linux.cpp:858: confused by earlier errors, bailing out
      gnumake[3]: *** [os_linux.o] Error 1
      gnumake[3]: *** Waiting for unfinished jobs....
      Done with /BUILD_AREA/jdk142-update/ws/rev/hotspot/src/os_cpu/linux_i486/vm/os_linux_i486.cpp
      Done with /BUILD_AREA/jdk142-update/ws/rev/hotspot/src/share/vm/memory/parNewGeneration.cpp
      Done with /BUILD_AREA/jdk142-update/ws/rev/hotspot/src/share/vm/gc_implementation/parallelScavenge/parallelScavengeHeap.cpp
      Done with /BUILD_AREA/jdk142-update/ws/rev/hotspot/src/share/vm/code/pcDesc.cpp
      Done with /BUILD_AREA/jdk142-update/ws/rev/hotspot/src/share/vm/opto/parse3.cpp
      Done with /BUILD_AREA/jdk142-update/ws/rev/hotspot/src/share/vm/opto/parseHelper.cpp
      Done with /BUILD_AREA/jdk142-update/ws/rev/hotspot/src/share/vm/opto/output.cpp
      Done with /BUILD_AREA/jdk142-update/ws/rev/hotspot/src/share/vm/opto/parse2.cpp
      Done with /BUILD_AREA/jdk142-update/ws/rev/hotspot/src/share/vm/opto/parse1.cpp
      gnumake[3]: Leaving directory `/BUILD_AREA/jdk142-update/ws/rev/control/build/linux-i586/hotspot-i586/tmp/linux_i486_compiler2/product'
      gnumake[2]: *** [the_vm] Error 2
      gnumake[2]: Leaving directory `/BUILD_AREA/jdk142-update/ws/rev/control/build/linux-i586/hotspot-i586/tmp/linux_i486_compiler2/product'
      gnumake[1]: *** [product] Error 2
      gnumake[1]: Leaving directory `/BUILD_AREA/jdk142-update/ws/rev/control/build/linux-i586/hotspot-i586/tmp'
      gnumake: *** [product] Error 2


      Solaris-sparc
      ===========

      Compiling /BUILD_AREA/jdk142-update/ws/rev/hotspot/src/share/vm/opto/parse1.cpp
      Compiling /BUILD_AREA/jdk142-update/ws/rev/hotspot/src/share/vm/opto/parse2.cpp
      Compiling /BUILD_AREA/jdk142-update/ws/rev/hotspot/src/share/vm/opto/parse3.cpp
      "/BUILD_AREA/jdk142-update/ws/rev/hotspot/src/os/solaris/vm/os_solaris.cpp", line 1561: Error: EM_X86_64 is not defined.
      "/BUILD_AREA/jdk142-update/ws/rev/hotspot/src/os/solaris/vm/os_solaris.cpp", line 1561: Error: EM_X86_64 is not defined.
      2 Error(s) detected.
      gnumake[3]: *** [os_solaris.o] Error 2
      gnumake[3]: *** Waiting for unfinished jobs....
      gnumake[3]: Leaving directory `/BUILD_AREA/jdk142-update/ws/rev/control/build/solaris-sparc/hotspot-sparc/tmp/solaris_sparc_compiler2/product'
      gnumake[2]: *** [the_vm] Error 2
      gnumake[2]: Leaving directory `/BUILD_AREA/jdk142-update/ws/rev/control/build/solaris-sparc/hotspot-sparc/tmp/solaris_sparc_compiler2/product'
      gnumake[1]: *** [product] Error 2
      gnumake[1]: Leaving directory `/BUILD_AREA/jdk142-update/ws/rev/control/build/solaris-sparc/hotspot-sparc/tmp'
      gnumake: *** [product] Error 2


      Solaris-sparcv9
      ============

      Compiling /BUILD_AREA/jdk142-update/ws/rev/hotspot/src/share/vm/opto/parse1.cpp
      Compiling /BUILD_AREA/jdk142-update/ws/rev/hotspot/src/share/vm/opto/parse2.cpp
      Compiling /BUILD_AREA/jdk142-update/ws/rev/hotspot/src/share/vm/opto/parse3.cpp
      Compiling /BUILD_AREA/jdk142-update/ws/rev/hotspot/src/share/vm/opto/parseHelper.cpp
      Compiling /BUILD_AREA/jdk142-update/ws/rev/hotspot/src/share/vm/code/pcDesc.cpp
      Compiling /BUILD_AREA/jdk142-update/ws/rev/hotspot/src/share/vm/prims/perf.cpp
      "/BUILD_AREA/jdk142-update/ws/rev/hotspot/src/os/solaris/vm/os_solaris.cpp", line 1561: Error: EM_X86_64 is not defined.
      "/BUILD_AREA/jdk142-update/ws/rev/hotspot/src/os/solaris/vm/os_solaris.cpp", line 1561: Error: EM_X86_64 is not defined.
      2 Error(s) detected.
      gnumake[3]: *** [os_solaris.o] Error 2
      gnumake[3]: *** Waiting for unfinished jobs....
      gnumake[3]: Leaving directory `/BUILD_AREA/jdk142-update/ws/rev/control/build/solaris-sparcv9/hotspot-sparcv9/tmp/solaris_sparcv9_compiler2/product'
      gnumake[2]: *** [the_vm] Error 2
      gnumake[2]: Leaving directory `/BUILD_AREA/jdk142-update/ws/rev/control/build/solaris-sparcv9/hotspot-sparcv9/tmp/solaris_sparcv9_compiler2/product'
      gnumake[1]: *** [product] Error 2
      gnumake[1]: Leaving directory `/BUILD_AREA/jdk142-update/ws/rev/control/build/solaris-sparcv9/hotspot-sparcv9/tmp'
      gnumake: *** [product] Error 2


      Solaris-i586
      ============
      Compiling /export1/BUILD_AREA/jdk142-update/ws/rev/hotspot/src/share/vm/opto/parse1.cpp
      Compiling /export1/BUILD_AREA/jdk142-update/ws/rev/hotspot/src/share/vm/opto/parse2.cpp
      Compiling /export1/BUILD_AREA/jdk142-update/ws/rev/hotspot/src/share/vm/opto/parse3.cpp
      Compiling /export1/BUILD_AREA/jdk142-update/ws/rev/hotspot/src/share/vm/opto/parseHelper.cpp
      "/export1/BUILD_AREA/jdk142-update/ws/rev/hotspot/src/os/solaris/vm/os_solaris.cpp", line 1561: Error: EM_X86_64 is not defined.
      "/export1/BUILD_AREA/jdk142-update/ws/rev/hotspot/src/os/solaris/vm/os_solaris.cpp", line 1561: Error: EM_X86_64 is not defined.
      2 Error(s) detected.
      gnumake[3]: *** [os_solaris.o] Error 2
      gnumake[3]: *** Waiting for unfinished jobs....
      gnumake[3]: Leaving directory `/export1/BUILD_AREA/jdk142-update/ws/rev/control/build/solaris-i586/hotspot-i586/tmp/solaris_i486_compiler2/product'
      gnumake[2]: *** [the_vm] Error 2
      gnumake[2]: Leaving directory `/export1/BUILD_AREA/jdk142-update/ws/rev/control/build/solaris-i586/hotspot-i586/tmp/solaris_i486_compiler2/product'
      gnumake[1]: *** [product] Error 2
      gnumake[1]: Leaving directory `/export1/BUILD_AREA/jdk142-update/ws/rev/control/build/solaris-i586/hotspot-i586/tmp'
      gnumake: *** [product] Error 2

        Attachments

          Issue Links

            Activity

              People

              • Assignee:
                poonam Poonam Bajaj Parhar
                Reporter:
                mtvo Hang Vo
              • Votes:
                0 Vote for this issue
                Watchers:
                2 Start watching this issue

                Dates

                • Created:
                  Updated:
                  Resolved:
                  Imported:
                  Indexed: