Uploaded image for project: 'JDK'
  1. JDK
  2. JDK-6741489

java/util/concurrent/FutureTask/BlockingTaskExecutor.java fails with java.lang.Error: Executor stuck

    XMLWordPrintable

    Details

      Description

      java/util/concurrent/FutureTask/BlockingTaskExecutor.java fails on windows-i586 with
      the following error message:
      ----------System.out:(3/128)----------
      ....................................................................................................
      Passed = 0, failed = 1

      ----------System.err:(23/1366)----------
      java.lang.Error: Executor stuck
      at BlockingTaskExecutor.test(BlockingTaskExecutor.java:75)
      at BlockingTaskExecutor.realMain(BlockingTaskExecutor.java:43)
      at BlockingTaskExecutor.main(BlockingTaskExecutor.java:160)
      at sun.reflect.NativeMethodAccessorImpl.invoke0(Native Method)
      at sun.reflect.NativeMethodAccessorImpl.invoke(NativeMethodAccessorImpl.java:57)
      at sun.reflect.DelegatingMethodAccessorImpl.invoke(DelegatingMethodAccessorImpl.java:43)
      at java.lang.reflect.Method.invoke(Method.java:623)
      at com.sun.javatest.regtest.MainWrapper$MainThread.run(MainWrapper.java:94)
      at java.lang.Thread.run(Thread.java:674)
      java.lang.AssertionError: Some tests failed
      at BlockingTaskExecutor.main(BlockingTaskExecutor.java:162)
      at sun.reflect.NativeMethodAccessorImpl.invoke0(Native Method)
      at sun.reflect.NativeMethodAccessorImpl.invoke(NativeMethodAccessorImpl.java:57)
      at sun.reflect.DelegatingMethodAccessorImpl.invoke(DelegatingMethodAccessorImpl.java:43)
      at java.lang.reflect.Method.invoke(Method.java:623)
      at com.sun.javatest.regtest.MainWrapper$MainThread.run(MainWrapper.java:94)
      at java.lang.Thread.run(Thread.java:674)

      JavaTest Message: Test threw exception: java.lang.AssertionError: Some tests failed
      JavaTest Message: shutting down test

      STATUS:Failed.`main' threw exception: java.lang.AssertionError: Some tests failed
      result: Failed. Execution failed: `main' threw exception: java.lang.AssertionError: Some tests failed


      test result: Failed. Execution failed: `main' threw exception: java.lang.AssertionError: Some tests failed
      Cannot reproduce with S:/jdk/re/7/promoted/all/b33/binaries/windows-i586
      Update: somehow it reproduced with b33 too on 7th time.
      So it seems to be quite intermittent.

        Attachments

          Issue Links

            Activity

              People

              Assignee:
              chegar Chris Hegarty
              Reporter:
              nzinovie Nikita Zinoviev (Inactive)
              Votes:
              0 Vote for this issue
              Watchers:
              0 Start watching this issue

                Dates

                Created:
                Updated:
                Resolved:
                Imported:
                Indexed: