Uploaded image for project: 'JDK'
  1. JDK
  2. JDK-6771774

3 tests fails in 1.4.2_18b91 and passed on 1.4.2_18b13j4b

    Details

    • Subcomponent:
    • CPU:
      x86
    • OS:
      windows_2008

      Description

      JDK : JDK 1.4.2_18b90_j4b,b91_j4b
      Platforms[s] : x64 - Windows 2008 - jvm64
      testbase : /net/vice.russia.sun.com/export/home0/dtf/dtf_ws/suites/142_Suites/awt

      This tests passed on 1.4.2_18b13_j4b

      3 testcases

      TEST 2/4 2/4 AWT_Merlin_WS/MerlinFocus/src/Automated/AWT/ActiveWindowTest/ActiveWindowTest.html FAIL
      TEST 3/4 3/4 AWT_Merlin_WS/MerlinFocus/src/Automated/AWT/FocusableWindowEventTest/FocusableWindowEventTest.html FAIL
      TEST 4/4 4/4 AWT_Merlin_WS/MerlinFocus/src/Automated/Swing/FocusableWindowEventTest/FocusableWindowEventTest.html FAIL

      Results 1.4.2_18b13:
      http://stt-13.russia.sun.com/results/1.4.2_18/b91_j4b/awt/win2008-amd64/retested/1.4.2_18b13/

      Results 1.4.2_18b91:
      http://stt-13.russia.sun.com/results/1.4.2_18/b91_j4b/awt/win2008-amd64/retested/1.4.2_18b91/

      Logs:

      FAILURE: When frame becomes active it is not receiving Focus gained java.awt.Frame[frame0,0,0,150x100,layout=java.awt.BorderLayout,title=Frame 1,resizable,iconified]
      FAILURE: When frame becomes inactive it is not receiving Focus lost java.awt.Frame[frame1,0,100,150x100,layout=java.awt.BorderLayout,title=Frame 2,resizable,iconified]
      java.lang.RuntimeException: TEST FAILED: When frame becomes active it is not receiving Focus gained java.awt.Frame[frame0,0,0,150x100,layout=java.awt.BorderLayout,title=Frame 1,resizable,iconified]: When frame becomes inactive it is not receiving Focus lost java.awt.Frame[frame1,0,100,150x100,layout=java.awt.BorderLayout,title=Frame 2,resizable,iconified]
      at javasoft.awtsqe.RobotAppletTest.destroy(RobotAppletTest.java:228)
      at com.sun.javatest.regtest.AppletWrapper$AppletThread.run(AppletWrapper.java:168)
      at java.lang.Thread.run(Thread.java:534)
      STATUS:Failed.Applet thread threw exception: java.lang.RuntimeException: TEST FAILED: When frame becomes active it is not receiving Focus gained java.awt.Frame[frame0,0,0,150x100,layout=java.awt.BorderLayout,title=Frame 1,resizable,iconified]: When frame becomes inactive it is not receiving Focus lost java.awt.Frame[frame1,0,100,150x100,layout=java.awt.BorderLayout,title=Frame 2,resizable,iconified]

        Attachments

          Activity

            People

            • Assignee:
              raginip Ragini Prasad (Inactive)
              Reporter:
              serb Sergey Bylokhov
            • Votes:
              0 Vote for this issue
              Watchers:
              0 Start watching this issue

              Dates

              • Created:
                Updated:
                Resolved:
                Imported:
                Indexed: