Uploaded image for project: 'JDK'
  1. JDK
  2. JDK-6820046

QuickTypeTest.html fail on windows xp home

    Details

    • Type: Bug
    • Status: Closed
    • Priority: P3
    • Resolution: Won't Fix
    • Affects Version/s: 6u11, 7
    • Fix Version/s: 6-pool
    • Component/s: client-libs
    • Labels:
    • Subcomponent:
    • Introduced In Version:
    • CPU:
      x86
    • OS:
      windows_xp

      Description

      results:
      http://stt-13.russia.sun.com/results/1.6.0_11/b06_j4b/awt/awt_stt_suites_winxphome-i586/run5/
      log:
      [2009-01-21T20:03:18.56] tf1's text = "ab"
      [2009-01-21T20:03:18.56] tf2's text = ""
      [2009-01-21T20:03:18.56] l1 = 2
      [2009-01-21T20:03:18.56] l2 = 0
      [2009-01-21T20:03:18.56] java.lang.RuntimeException: TEST FAILED.
      [2009-01-21T20:03:18.56] at QuickTypeTest.start(QuickTypeTest.java:142)
      [2009-01-21T20:03:18.56] at com.sun.javatest.regtest.AppletWrapper$AppletThread.run(AppletWrapper.java:58)
      [2009-01-21T20:03:18.56] at java.lang.Thread.run(Thread.java:619)
      [2009-01-21T20:03:18.56] STATUS:Failed.Applet thread threw exception: java.lang.RuntimeException: TEST FAILED.

      For more information see CR 6796425

        Attachments

          Issue Links

            Activity

              People

              • Assignee:
                denis Denis Fokin (Inactive)
                Reporter:
                mrkam Alexander Kuznetcov (Inactive)
              • Votes:
                0 Vote for this issue
                Watchers:
                0 Start watching this issue

                Dates

                • Created:
                  Updated:
                  Resolved:
                  Imported:
                  Indexed: