Uploaded image for project: 'JDK'
  1. JDK
  2. JDK-6848355

Reg-test /java/awt/Choice/PopupPosTest/PopupPosTest.html fails on Windows

    XMLWordPrintable

    Details

    • Subcomponent:
    • CPU:
      x86
    • OS:
      windows_xp

      Description

      The regresion testcase /java/awt/Choice/PopupPosTest/PopupPosTest.html failed on Windows Xp_ Prof on jdk7 b60 pit build and also jdk7 b59 build with the following output:

      java.lang.RuntimeException: Test failed. Another item wasn't selected.
      at TestFrame.<init>(PopupPosTest.java:73)
      at PopupPosTest.start(PopupPosTest.java:18)
      at com.sun.javatest.regtest.AppletWrapper$AppletThread.run(AppletWrapper.java:145)
      at java.lang.Thread.run(Thread.java:717)
      STATUS:Failed.Applet thread threw exception: java.lang.RuntimeException: Test failed. Another item wasn't selected.
      result: Failed. Execution failed: Applet thread threw exception: java.lang.RuntimeException: Test failed. Another item wasn't selected.

      Also attached is the .jtr file

        Attachments

          Activity

            People

            Assignee:
            dav Andrei Dmitriev (Inactive)
            Reporter:
            kpintosunw Karen Pinto (Inactive)
            Votes:
            0 Vote for this issue
            Watchers:
            3 Start watching this issue

              Dates

              Created:
              Updated:
              Resolved:
              Imported:
              Indexed: