Uploaded image for project: 'JDK'
  1. JDK
  2. JDK-6896159

1.4.2_24 debug build failed after 6560907 putback

    Details

    • Subcomponent:
    • Resolved In Build:
      b06
    • CPU:
      generic
    • OS:
      solaris_1
    • Verification:
      Verified

      Backports

        Description

        1.4.2_24 build failed after 6560907 putback in hotspot debug build:
        *** Sun Proprietary/Confidential: For Internal Use Only ***

        Origin : RE
        Product : j2sdk
        Version : 1.4.2_24
        Build : rev b00
        Nightly Timestamp:
        Master : /net/nightsvr.sfbay/INTEGRATION/1.4.2_24-rev
        Build Machine : jb4-win-i586
        Workspace : /java/re/jdk/1.4.2_24/nightly/ws/rev
        Logfile : /net/j4b.sfbay/usr/re/j4b/jdk1.4.2_24-nightly/logs/build-windows-i586.log

        Build Status :
           http://jre.sfbay/java/re/jdk/1.4.2_24/nightly

        Failure Status :
           http://j2se.sfbay.sun.com/web/bin/view/ReleaseEngineering/JavaRelaeseEngineeringBuildFailures
         
        Number of Errors: 6
        Logfile Error Report:

        #### RETAG "Start RE Build" "" "10/28/09 14:00:34"
        #### RETAG "Start Waiting for BringOver" "" "10/28/09 14:00:34"
        #### RETAG "End Waiting for BringOver" "SUCCEEDED" "10/28/09 14:06:02"
        #### RETAG "Start Waiting for CreateSrcBundles" "" "10/28/09 14:06:02"
        #### RETAG "End Waiting for CreateSrcBundles" "SUCCEEDED" "10/28/09 14:08:02"
        #### RETAG "Start Core Build" "" "10/28/09 14:08:02"
        ### local_ws= D:/BUILD_AREA/jdk142-update/ws/rev
        ### local_ws1= D:\BUILD_AREA\jdk142-update\ws\rev
        ### local_ws= D:/BUILD_AREA/jdk142-update/ws/rev
        ### local_ws1= D:\BUILD_AREA\jdk142-update\ws\rev
        Line number 1220: D:/BUILD_AREA/jdk142-update/ws/rev/hotspot\src\share\vm\opto\block.hpp(296) : error C2065: 'insert_anti_dependences' : undeclared identifier
        Line number 1221: NMAKE : fatal error U1077: 'cl.exe' : return code '0x2'
        Line number 1223: NMAKE : fatal error U1077: 'cd' : return code '0x2'
        Line number 1225: NMAKE : fatal error U1077: 'cd' : return code '0x2'
        Line number 1227: NMAKE : fatal error U1077: 'D:\PROGRA~1\MICROS~1\VC98\Bin\nmake.exe' : return code '0x2'
        Line number 1229: gnumake: *** [hotspot-compiler2] Error 2


        Thanks,

        Dave Katleman

          Attachments

            Issue Links

              Activity

                People

                • Assignee:
                  minqi Yumin Qi
                  Reporter:
                  minqi Yumin Qi
                • Votes:
                  0 Vote for this issue
                  Watchers:
                  1 Start watching this issue

                  Dates

                  • Created:
                    Updated:
                    Resolved:
                    Imported:
                    Indexed: