Uploaded image for project: 'JDK'
  1. JDK
  2. JDK-6979541

closed/javax/swing/plaf/basic/AWTEventListenerLeak/AWTEventListenerLeak.java fails

    XMLWordPrintable

    Details

    • Subcomponent:
    • Introduced In Build:
      b78
    • Introduced In Version:
      7
    • Resolved In Build:
      b116
    • CPU:
      x86
    • OS:
      linux_redhat_5.0
    • Verification:
      Verified

      Description

      Testsuite name: regression j2se
      test: closed/javax/swing/plaf/basic/AWTEventListenerLeak/AWTEventListenerLeak.java
      JDK/JRE tested: jdk 7 b106
      OS/architecture: rhel5-x64
      Reproducible: Always
      Reproducible on machine: stt-57.russia
      Is it a platform specific regression: N
      Is it a Regression: N

      Test run log location:
      [stt-robot@stt-57]$ cat cur/work/closed/javax/swing/plaf/basic/AWTEventListenerLeak/AWTEventListenerLeak.jtr
      #Test Results (version 2)
      #Tue Aug 24 19:45:48 MSD 2010
      #checksum:308b8d2d0b3cccfb
      #-----testdescription-----
      $file=/net/vice/export/stt/newroot/regression/workspaces/170/1.7.0_fcsb106/j2se/test/closed/javax/swing/plaf/basic/AWTEventListenerLeak/AWTEventListenerLeak.java
      $root=/net/vice/export/stt/newroot/regression/workspaces/170/1.7.0_fcsb106/j2se/test
      author=bchristi
      keywords=bug6264013 othervm
      run=USER_SPECIFIED main/othervm AWTEventListenerLeak\n
      source=AWTEventListenerLeak.java
      title=Test BasicLookAndFeel.AWTEventHelper leak

      #-----environment-----

      #-----testresult-----
      description=file:///net/vice/export/stt/newroot/regression/workspaces/170/1.7.0_fcsb106/j2se/test/closed/javax/swing/plaf/basic/AWTEventListenerLeak/AWTEventListenerLeak.java
      end=Tue Aug 24 19:45:48 MSD 2010
      environment=regtest
      execStatus=Failed. Execution failed: `main' threw exception: java.lang.RuntimeException: Test Failed!
      javatestOS=Linux 2.6.18-194.el5 (i386)
      javatestVersion=3.2.2_03
      script=com.sun.javatest.regtest.RegressionScript
      sections=script_messages build main
      start=Tue Aug 24 19:45:47 MSD 2010
      test=closed/javax/swing/plaf/basic/AWTEventListenerLeak/AWTEventListenerLeak.java
      work=/export/JQA/regression/cur/work/closed/javax/swing/plaf/basic/AWTEventListenerLeak

      #section:script_messages
      ----------messages:(4/186)----------
      JDK under test: (/export/jdk/jdk1.7.0b106)
      java version "1.7.0-ea"
      Java(TM) SE Runtime Environment (build 1.7.0-ea-b106)
      Java HotSpot(TM) Client VM (build 19.0-b05, mixed mode, sharing)

      #section:build
      ----------messages:(3/105)----------
      command: build AWTEventListenerLeak
      reason: Named class compiled on demand
      elapsed time (seconds): 0.001
      result: Passed. All files up to date

      #section:main
      ----------messages:(3/135)----------
      command: main AWTEventListenerLeak
      reason: User specified action: run main/othervm AWTEventListenerLeak
      elapsed time (seconds): 0.934
      ----------System.out:(12/579)----------
      TestFrame created on sun.awt.AppContext[threadGroup=system]
      TestFrame created on sun.awt.AppContext[threadGroup=system]
      TestFrame created on sun.awt.AppContext[threadGroup=createGroup 0]
      TestFrame created on sun.awt.AppContext[threadGroup=system]
      TestFrame created on sun.awt.AppContext[threadGroup=system]
      TestFrame created on sun.awt.AppContext[threadGroup=system]
      7 AppContexts
      Now destroy everything
      TestFrame.dispose()
      Done disposing AppContexts. Now count listeners
      1 AWTEventListeners remain on the Toolkit:
      javax.swing.plaf.basic.BasicLookAndFeel$AWTEventHelper@eee36c
      ----------System.err:(13/709)----------
      java.lang.RuntimeException: Test Failed!
      at AWTEventListenerLeak.main(AWTEventListenerLeak.java:128)
      at sun.reflect.NativeMethodAccessorImpl.invoke0(Native Method)
      at sun.reflect.NativeMethodAccessorImpl.invoke(NativeMethodAccessorImpl.java:57)
      at sun.reflect.DelegatingMethodAccessorImpl.invoke(DelegatingMethodAccessorImpl.java:43)
      at java.lang.reflect.Method.invoke(Method.java:613)
      at com.sun.javatest.regtest.MainWrapper$MainThread.run(MainWrapper.java:96)
      at java.lang.Thread.run(Thread.java:717)

      JavaTest Message: Test threw exception: java.lang.RuntimeException: Test Failed!
      JavaTest Message: shutting down test

      STATUS:Failed.`main' threw exception: java.lang.RuntimeException: Test Failed!
      result: Failed. Execution failed: `main' threw exception: java.lang.RuntimeException: Test Failed!


      test result: Failed. Execution failed: `main' threw exception: java.lang.RuntimeException: Test Failed!
      Steps to reproduce:
      [stt-robot@stt-57]$ /export/jdk/jdk1.7.0b106/bin/java AWTEventListenerLeak
      TestFrame created on sun.awt.AppContext[threadGroup=createGroup 0]
      TestFrame created on sun.awt.AppContext[threadGroup=system]
      TestFrame created on sun.awt.AppContext[threadGroup=system]
      TestFrame created on sun.awt.AppContext[threadGroup=system]
      TestFrame created on sun.awt.AppContext[threadGroup=system]
      TestFrame created on sun.awt.AppContext[threadGroup=system]
      7 AppContexts
      Now destroy everything
      TestFrame.dispose()
      Done disposing AppContexts. Now count listeners
      2 AWTEventListeners remain on the Toolkit:
      javax.swing.plaf.basic.BasicLookAndFeel$AWTEventHelper@fabe9
      java.awt.LightweightDispatcher@112f614
      Exception in thread "main" java.lang.RuntimeException: Test Failed!
      at AWTEventListenerLeak.main(AWTEventListenerLeak.java:128)

        Attachments

          Issue Links

            Activity

              People

              Assignee:
              art Artem Ananiev
              Reporter:
              ikobzaresunw Ivan Kobzarev (Inactive)
              Votes:
              0 Vote for this issue
              Watchers:
              0 Start watching this issue

                Dates

                Created:
                Updated:
                Resolved:
                Imported:
                Indexed: