Uploaded image for project: 'JDK'
  1. JDK
  2. JDK-6986807

TEST failure: java/beans/Introspector/TestTypeResolver.java - List<?extends Integer> should be List?

    Details

    • Type: Bug
    • Status: Closed
    • Priority: P3
    • Resolution: Cannot Reproduce
    • Affects Version/s: 7
    • Fix Version/s: None
    • Component/s: client-libs
    • Labels:
    • Subcomponent:
    • Introduced In Build:
      b112
    • Introduced In Version:
      7
    • CPU:
      generic
    • OS:
      generic

      Description

      Failed with JPRT sparc, but other platforms probably too.

      This could be some kind of javac issue? Maybe?

      --------------------------------------------------
      TEST: java/beans/Introspector/TestTypeResolver.java
      JDK under test: (/tmp/jprt/P2/T/182153.ss145989/testproduct/solaris_sparc_5.10-product)
      java version "1.7.0-internal"
      Java(TM) SE Runtime Environment (build 1.7.0-internal-jprtadm_2010_09_16_13_24-b00)
      Java HotSpot(TM) Client VM (build 19.0-b06-201009161821.ss145989.tl-pit-2d-awt-swin, mixed mode, sharing)

      ACTION: build -- Passed. Build successful
      REASON: Named class compiled on demand
      TIME: 0.192 seconds
      messages:
      command: build TestTypeResolver
      reason: Named class compiled on demand
      elapsed time (seconds): 0.192

      ACTION: compile -- Passed. Compilation successful
      REASON: .class file out of date or does not exist
      TIME: 0.192 seconds
      messages:
      command: compile /tmp/jprt/P2/T/182153.ss145989/source/jdk/test/java/beans/Introspector/TestTypeResolver.java
      reason: .class file out of date or does not exist
      elapsed time (seconds): 0.192
      direct:
      /tmp/jprt/P2/T/182153.ss145989/source/jdk/test/java/beans/Introspector/TestTypeResolver.java:30: warning: TypeResolver is internal proprietary API and may be removed in a future release
      import com.sun.beans.TypeResolver;
                          ^
      /tmp/jprt/P2/T/182153.ss145989/source/jdk/test/java/beans/Introspector/TestTypeResolver.java:44: warning: GenericArrayTypeImpl is internal proprietary API and may be removed in a future release
      import sun.reflect.generics.reflectiveObjects.GenericArrayTypeImpl;
                                                   ^
      /tmp/jprt/P2/T/182153.ss145989/source/jdk/test/java/beans/Introspector/TestTypeResolver.java:45: warning: ParameterizedTypeImpl is internal proprietary API and may be removed in a future release
      import sun.reflect.generics.reflectiveObjects.ParameterizedTypeImpl;
                                                   ^
      /tmp/jprt/P2/T/182153.ss145989/source/jdk/test/java/beans/Introspector/TestTypeResolver.java:110: warning: TypeResolver is internal proprietary API and may be removed in a future release
              t = TypeResolver.resolveInClass(c, t);
                  ^
      /tmp/jprt/P2/T/182153.ss145989/source/jdk/test/java/beans/Introspector/TestTypeResolver.java:301: warning: ParameterizedTypeImpl is internal proprietary API and may be removed in a future release
              static final Type expect = ParameterizedTypeImpl.make(
                                         ^
      /tmp/jprt/P2/T/182153.ss145989/source/jdk/test/java/beans/Introspector/TestTypeResolver.java:306: warning: ParameterizedTypeImpl is internal proprietary API and may be removed in a future release
              static final Type expect = ParameterizedTypeImpl.make(
                                         ^
      /tmp/jprt/P2/T/182153.ss145989/source/jdk/test/java/beans/Introspector/TestTypeResolver.java:315: warning: ParameterizedTypeImpl is internal proprietary API and may be removed in a future release
              static final Type expect = ParameterizedTypeImpl.make(
                                         ^
      /tmp/jprt/P2/T/182153.ss145989/source/jdk/test/java/beans/Introspector/TestTypeResolver.java:320: warning: ParameterizedTypeImpl is internal proprietary API and may be removed in a future release
              static final Type expect = ParameterizedTypeImpl.make(
                                         ^
      /tmp/jprt/P2/T/182153.ss145989/source/jdk/test/java/beans/Introspector/TestTypeResolver.java:325: warning: ParameterizedTypeImpl is internal proprietary API and may be removed in a future release
              static final Type expect = ParameterizedTypeImpl.make(
                                         ^
      /tmp/jprt/P2/T/182153.ss145989/source/jdk/test/java/beans/Introspector/TestTypeResolver.java:334: warning: ParameterizedTypeImpl is internal proprietary API and may be removed in a future release
              static final Type expect = ParameterizedTypeImpl.make(
                                         ^
      /tmp/jprt/P2/T/182153.ss145989/source/jdk/test/java/beans/Introspector/TestTypeResolver.java:412: warning: ParameterizedTypeImpl is internal proprietary API and may be removed in a future release
                      ParameterizedTypeImpl.make(List.class, new Type[] {String.class}, null));
                      ^
      /tmp/jprt/P2/T/182153.ss145989/source/jdk/test/java/beans/Introspector/TestTypeResolver.java:411: warning: GenericArrayTypeImpl is internal proprietary API and may be removed in a future release
              static final Type expect = GenericArrayTypeImpl.make(
                                         ^
      /tmp/jprt/P2/T/182153.ss145989/source/jdk/test/java/beans/Introspector/TestTypeResolver.java:416: warning: GenericArrayTypeImpl is internal proprietary API and may be removed in a future release
              static final Type expect = GenericArrayTypeImpl.make(
                                         ^
      /tmp/jprt/P2/T/182153.ss145989/source/jdk/test/java/beans/Introspector/TestTypeResolver.java:425: warning: ParameterizedTypeImpl is internal proprietary API and may be removed in a future release
              static final Type expect = ParameterizedTypeImpl.make(
                                         ^
      /tmp/jprt/P2/T/182153.ss145989/source/jdk/test/java/beans/Introspector/TestTypeResolver.java:430: warning: ParameterizedTypeImpl is internal proprietary API and may be removed in a future release
              static final Type expect = ParameterizedTypeImpl.make(
                                         ^
      /tmp/jprt/P2/T/182153.ss145989/source/jdk/test/java/beans/Introspector/TestTypeResolver.java:440: warning: ParameterizedTypeImpl is internal proprietary API and may be removed in a future release
              static final Type expect = ParameterizedTypeImpl.make(
                                         ^
      /tmp/jprt/P2/T/182153.ss145989/source/jdk/test/java/beans/Introspector/TestTypeResolver.java:459: warning: ParameterizedTypeImpl is internal proprietary API and may be removed in a future release
              static final Type expect = ParameterizedTypeImpl.make(
                                         ^
      /tmp/jprt/P2/T/182153.ss145989/source/jdk/test/java/beans/Introspector/TestTypeResolver.java:469: warning: ParameterizedTypeImpl is internal proprietary API and may be removed in a future release
              static final Type expect = ParameterizedTypeImpl.make(
                                         ^
      /tmp/jprt/P2/T/182153.ss145989/source/jdk/test/java/beans/Introspector/TestTypeResolver.java:479: warning: ParameterizedTypeImpl is internal proprietary API and may be removed in a future release
              static final Type expect = ParameterizedTypeImpl.make(
                                         ^
      /tmp/jprt/P2/T/182153.ss145989/source/jdk/test/java/beans/Introspector/TestTypeResolver.java:492: warning: ParameterizedTypeImpl is internal proprietary API and may be removed in a future release
              static final Type expect = ParameterizedTypeImpl.make(
                                         ^
      /tmp/jprt/P2/T/182153.ss145989/source/jdk/test/java/beans/Introspector/TestTypeResolver.java:502: warning: ParameterizedTypeImpl is internal proprietary API and may be removed in a future release
                              ParameterizedTypeImpl.make(
                              ^
      /tmp/jprt/P2/T/182153.ss145989/source/jdk/test/java/beans/Introspector/TestTypeResolver.java:499: warning: ParameterizedTypeImpl is internal proprietary API and may be removed in a future release
              static final Type expect = ParameterizedTypeImpl.make(
                                         ^
      /tmp/jprt/P2/T/182153.ss145989/source/jdk/test/java/beans/Introspector/TestTypeResolver.java:513: warning: ParameterizedTypeImpl is internal proprietary API and may be removed in a future release
                              ParameterizedTypeImpl.make(
                              ^
      /tmp/jprt/P2/T/182153.ss145989/source/jdk/test/java/beans/Introspector/TestTypeResolver.java:510: warning: ParameterizedTypeImpl is internal proprietary API and may be removed in a future release
              static final Type expect = ParameterizedTypeImpl.make(
                                         ^
      24 warnings

      ACTION: main -- Failed. Execution failed: `main' threw exception: java.lang.Error: TEST FAILED
      REASON: Assumed action based on file name: run main TestTypeResolver
      TIME: 0.051 seconds
      messages:
      command: main TestTypeResolver
      reason: Assumed action based on file name: run main TestTypeResolver
      elapsed time (seconds): 0.051
      STDOUT:
      Test class TestTypeResolver
      Test class TestTypeResolver$Bound
      ...T, as expected
      Test class TestTypeResolver$BoundInt
      ...class java.lang.Integer, as expected
      Test class TestTypeResolver$GenericArray
      ...java.util.List<java.lang.String>[], as expected
      Test class TestTypeResolver$GenericArrayT
      ...T[], as expected
      Test class TestTypeResolver$GenericArrayTSub
      ...class [[Ljava.lang.String;, as expected
      Test class TestTypeResolver$Impl
      ...class java.lang.String, as expected
      Test class TestTypeResolver$Impl2
      ...class java.lang.String, as expected
      Test class TestTypeResolver$Int
      ...class java.lang.Integer, as expected
      Test class TestTypeResolver$IntOverride
      ...class java.lang.Integer, as expected
      Test interface TestTypeResolver$Intf
      ...T, as expected
      Test class TestTypeResolver$ListInt
      ...java.util.List<java.lang.Integer>, as expected
      Test class TestTypeResolver$ListIntSub
      ...java.util.List<java.lang.Integer>, as expected
      Test class TestTypeResolver$ListListString
      ...java.util.List<java.util.List<java.lang.String>>, as expected
      Test class TestTypeResolver$ListListT
      ...java.util.List<java.util.List<T>>, as expected
      Test class TestTypeResolver$ListU
      ...java.util.List<U>, as expected
      Test class TestTypeResolver$ListUInt
      ...java.util.List<java.lang.Integer>, as expected
      Test class TestTypeResolver$ListUSub
      ...java.util.List<V>, as expected
      Test class TestTypeResolver$ListUSubInt
      ...java.util.List<java.lang.Integer>, as expected
      Test class TestTypeResolver$MethodParam
      ...T, as expected
      Test class TestTypeResolver$Mid
      ...X, as expected
      Test class TestTypeResolver$Outer
      Test class TestTypeResolver$Outer$Inner
      ...T, as expected
      Test class TestTypeResolver$Raw
      ...class java.lang.Object, as expected
      Test class TestTypeResolver$RawBound
      ...class java.lang.Number, as expected
      Test class TestTypeResolver$RawBoundInt
      ...class java.lang.Integer, as expected
      Test class TestTypeResolver$RawSub
      ...class java.lang.Object, as expected
      Test class TestTypeResolver$RawWildcardTSubSub
      ...java.util.List<? extends java.lang.Integer> BUT SHOULD BE interface java.util.List
      Test class TestTypeResolver$SelfRef
      ...T, as expected
      Test class TestTypeResolver$SelfRefSub
      ...class TestTypeResolver$SelfRefSub, as expected
      Test class TestTypeResolver$SimpleArray
      ...class [Ljava.lang.String;, as expected
      Test class TestTypeResolver$Str
      ...class java.lang.String, as expected
      Test class TestTypeResolver$SubMap
      ...java.util.Map<java.lang.String, java.lang.Integer>, as expected
      Test class TestTypeResolver$Super
      ...T, as expected
      Test class TestTypeResolver$SuperMap
      ...java.util.Map<K, V>, as expected
      Test class TestTypeResolver$TwoParams
      ...S, as expected
      Test class TestTypeResolver$TwoParamsSub
      ...T, as expected
      Test class TestTypeResolver$TwoParamsSubSub
      ...class java.lang.String, as expected
      Test class TestTypeResolver$UExtendsT
      ...U, as expected
      Test class TestTypeResolver$UExtendsTSub
      ...class java.lang.Integer, as expected
      Test class TestTypeResolver$Wildcard
      ...java.util.List<?>, as expected
      Test class TestTypeResolver$WildcardT
      ...java.util.List<? extends T>, as expected
      Test class TestTypeResolver$WildcardTSub
      ...java.util.List<? extends java.lang.Integer>, as expected
      Test class TestTypeResolver$WildcardTSubSub
      ...java.util.List<? extends java.lang.Integer>, as expected
      Test class TestTypeResolver$WildcardTSuper
      ...java.util.List<? super T>, as expected
      Test class TestTypeResolver$WildcardTSuperSub
      ...java.util.List<? super java.lang.Integer>, as expected
      TEST FAILED: failed cases: [class TestTypeResolver$RawWildcardTSubSub]
      STDERR:
      java.lang.Error: TEST FAILED
      at TestTypeResolver.main(TestTypeResolver.java:56)
      at sun.reflect.NativeMethodAccessorImpl.invoke0(Native Method)
      at sun.reflect.NativeMethodAccessorImpl.invoke(NativeMethodAccessorImpl.java:57)
      at sun.reflect.DelegatingMethodAccessorImpl.invoke(DelegatingMethodAccessorImpl.java:43)
      at java.lang.reflect.Method.invoke(Method.java:613)
      at com.sun.javatest.regtest.MainAction$SameVMRunnable.run(MainAction.java:680)
      at java.lang.Thread.run(Thread.java:729)

      JavaTest Message: Test threw exception: java.lang.Error
      JavaTest Message: shutting down test


      TEST RESULT: Failed. Execution failed: `main' threw exception: java.lang.Error: TEST FAILED
      --------------------------------------------------

        Attachments

          Issue Links

            Activity

              People

              • Assignee:
                malenkov Sergey Malenkov (Inactive)
                Reporter:
                ohair Kelly Ohair (Inactive)
              • Votes:
                0 Vote for this issue
                Watchers:
                0 Start watching this issue

                Dates

                • Created:
                  Updated:
                  Resolved:
                  Imported:
                  Indexed: