Uploaded image for project: 'JDK'
  1. JDK
  2. JDK-7067676

test/sun/nio/cs/FindDecoderBugs.java failing intermittently

    Details

    • Type: Bug
    • Status: Closed
    • Priority: P3
    • Resolution: Cannot Reproduce
    • Affects Version/s: 8
    • Fix Version/s: None
    • Component/s: core-libs

      Description

      This test failed once on prt-sol-x64-3 with a build of jdk8/tl/jdk (jdk8-b00, roughly jdk7-b147).


      --------------------------------------------------
      TEST: sun/nio/cs/FindDecoderBugs.java
      JDK under test: (/tmp/jprt/P1/101243.ab23780/testproduct/solaris_x64_5.10-product)
      java version "1.8.0-internal"
      Java(TM) SE Runtime Environment (build 1.8.0-internal-201107151012.ab23780.jdk-b00)
      Java HotSpot(TM) 64-Bit Server VM (build 21.0-b17, mixed mode)

      ACTION: build -- Passed. Build successful
      REASON: Named class compiled on demand
      TIME: 0.194 seconds
      messages:
      command: build FindDecoderBugs
      reason: Named class compiled on demand
      elapsed time (seconds): 0.194

      ACTION: compile -- Passed. Compilation successful
      REASON: .class file out of date or does not exist
      TIME: 0.193 seconds
      messages:
      command: compile /tmp/jprt/P1/101243.ab23780/source/test/sun/nio/cs/FindDecoderBugs.java
      reason: .class file out of date or does not exist
      elapsed time (seconds): 0.193

      ACTION: main -- Failed. Execution failed: `main' threw exception: java.lang.AssertionError: Some tests failed
      REASON: User specified action: run main/timeout=1800 FindDecoderBugs
      TIME: 65.007 seconds
      messages:
      command: main FindDecoderBugs
      reason: User specified action: run main/timeout=1800 FindDecoderBugs
      elapsed time (seconds): 65.007
      STDOUT:
      Big5
      Big5-HKSCS
      EUC-JP
      EUC-KR
      GB18030
      GB2312
      GBK
      IBM-Thai
      IBM00858
      IBM01140
      IBM01141
      IBM01142
      IBM01143
      IBM01144
      IBM01145
      IBM01146
      IBM01147
      IBM01148
      IBM01149
      IBM037
      IBM1026
      IBM1047
      IBM273
      IBM277
      IBM278
      IBM280
      IBM284
      IBM285
      IBM297
      IBM420
      IBM424
      IBM437
      IBM500
      IBM775
      IBM850
      IBM852
      IBM855
      IBM857
      IBM860
      IBM861
      IBM862
      IBM863
      IBM864
      IBM865
      IBM866
      IBM868
      IBM869
      IBM870
      IBM871
      IBM918
      ISO-2022-CN
      Testing prefix 0e
      Testing prefix 0f
      Testing prefix 1b
      Testing prefix 1b 24
      Testing prefix 1b 24 41
      Testing prefix 1b 24 29 41
      Testing prefix 1b 24 29 47
      Testing prefix 1b 24 2a 48
      Testing prefix 1b 24 2b 49
      ISO-2022-JP
      Testing prefix 0e
      Testing prefix 0f
      Testing prefix 1b
      Testing prefix 1b 28
      Testing prefix 1b 24
      Testing prefix 1b 28 42
      Testing prefix 1b 28 49
      Testing prefix 1b 28 4a
      Testing prefix 1b 24 40
      Testing prefix 1b 24 42
      ISO-2022-JP-2
      Testing prefix 0e
      Testing prefix 0f
      Testing prefix 1b
      Testing prefix 1b 28
      Testing prefix 1b 24
      Testing prefix 1b 24 28
      Testing prefix 1b 28 42
      Testing prefix 1b 28 49
      Testing prefix 1b 28 4a
      Testing prefix 1b 24 40
      Testing prefix 1b 24 42
      Testing prefix 1b 24 28 44
      ISO-2022-KR
      Testing prefix 0e
      Testing prefix 0f
      Testing prefix 1b
      Testing prefix 1b 28
      Testing prefix 1b 24
      Testing prefix 1b 24 28
      Testing prefix 1b 24 29 43
      ISO-8859-1
      ISO-8859-13
      ISO-8859-15
      ISO-8859-2
      ISO-8859-3
      ISO-8859-4
      ISO-8859-5
      ISO-8859-6
      ISO-8859-7
      ISO-8859-8
      ISO-8859-9
      JIS_X0201
      JIS_X0212-1990
      KOI8-R
      KOI8-U
      Shift_JIS
      TIS-620
      US-ASCII
      UTF-16
      UTF-16BE
      UTF-16LE
      UTF-32
      UTF-32BE
      UTF-32LE
      UTF-8
      windows-1250
      windows-1251
      windows-1252
      windows-1253
      windows-1254
      windows-1255
      windows-1256
      windows-1257
      windows-1258
      windows-31j
      x-Big5-HKSCS-2001
      x-Big5-Solaris
      Skipping possibly broken charset x-COMPOUND_TEXT
      x-euc-jp-linux
      x-EUC-TW
      x-eucJP-Open
      x-IBM1006
      x-IBM1025
      x-IBM1046
      x-IBM1097
      x-IBM1098
      x-IBM1112
      x-IBM1122
      x-IBM1123
      x-IBM1124
      x-IBM1364
      Testing prefix 0e
      x-IBM1381
      x-IBM1383
      x-IBM33722
      x-IBM737
      x-IBM833
      x-IBM834
      Testing prefix 1b
      x-IBM856
      x-IBM874
      x-IBM875
      x-IBM921
      x-IBM922
      x-IBM930
      Testing prefix 0e
      x-IBM933
      Testing prefix 0e
      x-IBM935
      Testing prefix 0e
      x-IBM937
      Testing prefix 0e
      x-IBM939
      Testing prefix 0e
      x-IBM942
      x-IBM942C
      x-IBM943
      x-IBM943C
      x-IBM948
      x-IBM949
      x-IBM949C
      x-IBM950
      x-IBM964
      x-IBM970
      x-ISCII91
      x-ISO-2022-CN-CNS
      Testing prefix 0e
      Testing prefix 0f
      Testing prefix 1b
      Testing prefix 1b 24
      Testing prefix 1b 24 41
      Testing prefix 1b 24 29 41
      Testing prefix 1b 24 29 47
      Testing prefix 1b 24 2a 48
      Testing prefix 1b 24 2b 49
      x-ISO-2022-CN-GB
      Testing prefix 0e
      Testing prefix 0f
      Testing prefix 1b
      Testing prefix 1b 24
      Testing prefix 1b 24 41
      Testing prefix 1b 24 29 41
      Testing prefix 1b 24 29 47
      Testing prefix 1b 24 2a 48
      Testing prefix 1b 24 2b 49
      x-iso-8859-11
      x-JIS0208
      x-JISAutoDetect
      Results differ: x-JISAutoDetect
          "5a 1b 24 40"[4/4] => UNDERFLOW "\u005a"[1/19]
          "5a 1b 24 40"[1/4] => OVERFLOW "\u005a"[1/1]
      Testing prefix 1b
      Testing prefix 1b 28
      Testing prefix 1b 24
      Testing prefix 1b 28 42
      Testing prefix 1b 28 49
      Testing prefix 1b 28 4a
      Testing prefix 1b 24 40
      Testing prefix 1b 24 42
      x-Johab
      x-MacArabic
      x-MacCentralEurope
      x-MacCroatian
      x-MacCyrillic
      x-MacDingbat
      x-MacGreek
      x-MacHebrew
      x-MacIceland
      x-MacRoman
      x-MacRomania
      x-MacSymbol
      x-MacThai
      x-MacTurkish
      x-MacUkraine
      x-MS932_0213
      x-MS950-HKSCS
      x-MS950-HKSCS-XP
      x-mswin-936
      x-PCK
      x-SJIS_0213
      x-UTF-16LE-BOM
      X-UTF-32BE-BOM
      Testing prefix 1b
      Testing prefix 1b 28
      Testing prefix 1b 24
      Testing prefix 1b 24 28
      X-UTF-32LE-BOM
      Testing prefix 1b
      Testing prefix 1b 28
      Testing prefix 1b 24
      Testing prefix 1b 24 28
      x-windows-50220
      Testing prefix 0e
      Testing prefix 0f
      Testing prefix 1b
      Testing prefix 1b 28
      Testing prefix 1b 24
      Testing prefix 1b 24 28
      Testing prefix 1b 28 42
      Testing prefix 1b 28 49
      Testing prefix 1b 28 4a
      Testing prefix 1b 24 40
      Testing prefix 1b 24 42
      Testing prefix 1b 24 28 44
      x-windows-50221
      Testing prefix 0e
      Testing prefix 0f
      Testing prefix 1b
      Testing prefix 1b 28
      Testing prefix 1b 24
      Testing prefix 1b 24 28
      Testing prefix 1b 28 42
      Testing prefix 1b 28 49
      Testing prefix 1b 28 4a
      Testing prefix 1b 24 40
      Testing prefix 1b 24 42
      Testing prefix 1b 24 28 44
      x-windows-874
      x-windows-949
      x-windows-950
      x-windows-iso2022jp
      Testing prefix 0e
      Testing prefix 0f
      Testing prefix 1b
      Testing prefix 1b 28
      Testing prefix 1b 24
      Testing prefix 1b 28 42
      Testing prefix 1b 28 49
      Testing prefix 1b 28 4a
      Testing prefix 1b 24 40
      Testing prefix 1b 24 42
      -----
      Results differ: x-JISAutoDetect
          "??"[4/4] => UNDERFLOW "u????"[1/19]
          "??"[1/4] => OVERFLOW "u????"[1/1]
      failures=1

      Passed = 510573538, failed = 1

      STDERR:
      java.lang.AssertionError: Some tests failed
      at FindDecoderBugs.main(FindDecoderBugs.java:444)
      at sun.reflect.NativeMethodAccessorImpl.invoke0(Native Method)
      at sun.reflect.NativeMethodAccessorImpl.invoke(NativeMethodAccessorImpl.java:57)
      at sun.reflect.DelegatingMethodAccessorImpl.invoke(DelegatingMethodAccessorImpl.java:43)
      at java.lang.reflect.Method.invoke(Method.java:601)
      at com.sun.javatest.regtest.MainAction$SameVMRunnable.run(MainAction.java:680)
      at java.lang.Thread.run(Thread.java:722)

      JavaTest Message: Test threw exception: java.lang.AssertionError
      JavaTest Message: shutting down test


      TEST RESULT: Failed. Execution failed: `main' threw exception: java.lang.AssertionError: Some tests failed
      --------------------------------------------------

        Attachments

          Issue Links

            Activity

              People

              • Assignee:
                Unassigned
                Reporter:
                alanb Alan Bateman
              • Votes:
                0 Vote for this issue
                Watchers:
                3 Start watching this issue

                Dates

                • Created:
                  Updated:
                  Resolved:
                  Imported:
                  Indexed: