Uploaded image for project: 'JDK'
  1. JDK
  2. JDK-7104818

Win32 nightly build for 7u2 failed at step 2, attempting to build 3264 combo installer.

    Details

    • Type: Bug
    • Status: Closed
    • Priority: P1
    • Resolution: Fixed
    • Affects Version/s: 7u2
    • Fix Version/s: 7u2
    • Component/s: infrastructure
    • Labels:
      None
    • Subcomponent:
    • Resolved In Build:
      b11
    • CPU:
      generic
    • OS:
      generic
    • Verification:
      Verified

      Description

      jdk7u2_dev-2-build-windows-i586-product at 10/25:

      C:/mks/mksnt/mkdir -p C:/dev7u2_32P/jdk7u2_dev/build/windows-i586/tmp/wrapper-jdk-fxsdk/sign && C:/jdk1.6.0_14/bin/java -Xmx1024m -jar C:/utils/Client.jar -user java_re -pass java_re123 -sign_method microsoft -signed_location C:/dev7u2_32P/jdk7u2_dev/build/windows-i586/tmp/wrapper-jdk-fxsdk/sign -file_to_sign C:/dev7u2_32P/jdk7u2_dev/build/windows-i586/tmp/wrapper-jdk-fxsdk/obj/jdk-fxsdk.exe && if [ -s C:/dev7u2_32P/jdk7u2_dev/build/windows-i586/tmp/wrapper-jdk-fxsdk/sign/`C:/mks/mksnt/basename C:/dev7u2_32P/jdk7u2_dev/build/windows-i586/tmp/wrapper-jdk-fxsdk/obj/jdk-fxsdk.exe ` ] ; then C:/mks/mksnt/echo "Successful signing of C:/dev7u2_32P/jdk7u2_dev/build/windows-i586/tmp/wrapper-jdk-fxsdk/obj/jdk-fxsdk.exe " ; C:/mks/mksnt/mv C:/dev7u2_32P/jdk7u2_dev/build/windows-i586/tmp/wrapper-jdk-fxsdk/sign/`C:/mks/mksnt/basename C:/dev7u2_32P/jdk7u2_dev/build/windows-i586/tmp/wrapper-jdk-fxsdk/obj/jdk-fxsdk.exe ` C:/dev7u2_32P/jdk7u2_dev/build/windows-i586/tmp/wrapper-jdk-fxsdk/obj/jdk-fxsdk.exe ; else C:/mks/mksnt/echo "WARNING: Signing of C:/dev7u2_32P/jdk7u2_dev/build/windows-i586/tmp/wrapper-jdk-fxsdk/obj/jdk-fxsdk.exe in C:/dev7u2_32P/jdk7u2_dev/build/windows-i586/tmp/wrapper-jdk-fxsdk/sign/`C:/mks/mksnt/basename C:/dev7u2_32P/jdk7u2_dev/build/windows-i586/tmp/wrapper-jdk-fxsdk/obj/jdk-fxsdk.exe ` failed." ; exit 1 ; fi
      Successful signing of C:/dev7u2_32P/jdk7u2_dev/build/windows-i586/tmp/wrapper-jdk-fxsdk/obj/jdk-fxsdk.exe
      C:/mks/mksnt/cp C:/dev7u2_32P/jdk7u2_dev/build/windows-i586/tmp/wrapper-jdk-fxsdk/obj/jdk-fxsdk.exe C:/dev7u2_32P/jdk7u2_dev/build/windows-i586/bundles/jdk-fxsdk-combo-7u2-ea-bin-b9297-windows-i586-24_oct_2011.exe
      gnumake[7]: Leaving directory `C:/dev7u2_32P/jdk7u2_dev/install/make/installer/bundles/windows/ishield/wrapper/wrapper.jdkfxsdk'
      <<<Finished Recursively making wrapper.jdkfxsdk build @ Mon Oct 24 21:15:16 PDT 2011.
      Error: The combo jre installer is not built since the 64-bit Installer path is not found
      gnumake[6]: *** [build] Error 1
      gnumake[6]: Leaving directory `C:/dev7u2_32P/jdk7u2_dev/install/make/installer/bundles/windows/ishield/wrapper'
      gnumake[5]: *** [all] Error 1
      gnumake[5]: Leaving directory `C:/dev7u2_32P/jdk7u2_dev/install/make/installer/bundles/windows/ishield'
      gnumake[4]: *** [all] Error 1
      gnumake[4]: Leaving directory `C:/dev7u2_32P/jdk7u2_dev/install/make/installer/bundles/windows'
      gnumake[3]: *** [all] Error 2
      gnumake[3]: Leaving directory `C:/dev7u2_32P/jdk7u2_dev/install/make/installer/bundles'
      gnumake[2]: *** [all] Error 1
      gnumake[2]: Leaving directory `C:/dev7u2_32P/jdk7u2_dev/install/make/installer'
      gnumake[1]: *** [all] Error 1
      gnumake[1]: Leaving directory `C:/dev7u2_32P/jdk7u2_dev/install/make'
      gnumake: *** [install-build] Error 2
      + gmkexitcode=2
      + [ 2 -ne 0 ]
      + errorExit gnumake failed, return code 2
      + echo ERROR: gnumake failed, return code 2
      ERROR: gnumake failed, return code 2
      + exit 3
      Notifying upstream projects of job completion
      Finished: FAILURE

        Attachments

          Issue Links

            Activity

              People

              • Assignee:
                cl Christine Lu (Inactive)
                Reporter:
                suwei Sue Wei
              • Votes:
                0 Vote for this issue
                Watchers:
                0 Start watching this issue

                Dates

                • Created:
                  Updated:
                  Resolved:
                  Imported:
                  Indexed: