Uploaded image for project: 'JDK'
  1. JDK
  2. JDK-7129929

deploy forest unbuildable for macosx-amd64

    Details

    • Subcomponent:
    • Resolved In Build:
      b22
    • CPU:
      sparc
    • OS:
      generic
    • Verification:
      Not verified

      Backports

        Description

        deploy forest (7u-osx) is unbuildable for macosx-amd64

        Looks like the JAVA_HOME setting needs to look elsewhere when building on macosx

        ########################################################################
        ########################################################################
        ##### Entering deploy for target(s) sanity deploy images #####
        ########################################################################

        (cd ./deploy/make && \
        gnumake sanity deploy images JDK_TOPDIR=/HUDSON/workspace/REtestA-2-build-macosx-amd64-product/REtestA/jdk JDK_MAKE_SHARED_DIR=/HUDSON/workspace/REtestA-2-build-macosx-amd64-product/REtestA/jdk/make/common/shared EXTERNALSANITYCONTROL=true SOURCE_LANGUAGE_VERSION=7 TARGET_CLASS_VERSION=7 MILESTONE=ea BUILD_NUMBER=b225 JDK_BUILD_NUMBER=b225 FULL_VERSION=1.7.0_04-ea-fastdebug-b225 PREVIOUS_JDK_VERSION=1.6.0 JDK_VERSION=1.7.0_04 JDK_MKTG_VERSION=7u4 JDK_MAJOR_VERSION=1 JDK_MINOR_VERSION=7 JDK_MICRO_VERSION=0 PREVIOUS_MAJOR_VERSION=1 PREVIOUS_MINOR_VERSION=6 PREVIOUS_MICRO_VERSION=0 ARCH_DATA_MODEL=64 VARIANT=DBG FASTDEBUG=true DEBUG_CLASSFILES=true COOKED_JDK_UPDATE_VERSION=40 COOKED_BUILD_NUMBER=225 ANT_HOME="/localtools/share/ant/latest" ALT_OUTPUTDIR=/HUDSON/workspace/REtestA-2-build-macosx-amd64-product/REtestA/build/macosx-amd64/../macosx-amd64-fastdebug ALT_LANGTOOLS_DIST=/HUDSON/workspace/REtestA-2-build-macosx-amd64-product/REtestA/build/macosx-amd64/../macosx-amd64-fastdebug/langtools/dist)
        /bin/sh: system_profiler: command not found
        expr: syntax error
        /HUDSON/workspace/REtestA-2-build-macosx-amd64-product/REtestA/jdk/make/common/shared/Sanity-Settings.gmk:195: WARNING: MB_OF_MEMORY should not be empty [Sanity-Settings.gmk]
        Removing ant config file ../make/ant/workspace-generated.properties
        rm -f -f ../make/ant/workspace-generated.properties
        gnumake -C ../make/javaws all
        /bin/sh: system_profiler: command not found
        expr: syntax error
        echo "Generating ant environment to ../../make/ant/workspace-generated.properties"
        Generating ant environment to ../../make/ant/workspace-generated.properties
        echo "ws.java.executable=/HUDSON/workspace/REtestA-2-build-macosx-amd64-product/REtestA/build/macosx-amd64/../macosx-amd64-fastdebug/j2sdk-image/bin/java" > ../../make/ant/workspace-generated.properties
        echo "ws.javac.executable=/HUDSON/workspace/REtestA-2-build-macosx-amd64-product/REtestA/build/macosx-amd64/../macosx-amd64-fastdebug/j2sdk-image/bin/javac" >> ../../make/ant/workspace-generated.properties
        echo "ws.pack.executable=/HUDSON/workspace/REtestA-2-build-macosx-amd64-product/REtestA/build/macosx-amd64/../macosx-amd64-fastdebug/j2sdk-image/bin/pack200" >> ../../make/ant/workspace-generated.properties
        echo "ws.javaws.executable=/HUDSON/workspace/REtestA-2-build-macosx-amd64-product/REtestA/build/macosx-amd64/../macosx-amd64-fastdebug/j2sdk-image/bin/javaws" >> ../../make/ant/workspace-generated.properties
        echo "ws.javac.fork=true" >> ../../make/ant/workspace-generated.properties
        echo "ws.javac.nowarn=true" >> ../../make/ant/workspace-generated.properties
        echo "ws.javac.debug=true" >> ../../make/ant/workspace-generated.properties
        echo "ws.platform=macosx" >> ../../make/ant/workspace-generated.properties
        echo "ws.platform.flavor=macosx" >> ../../make/ant/workspace-generated.properties
        echo "ws.output.jreimage=/HUDSON/workspace/REtestA-2-build-macosx-amd64-product/REtestA/build/macosx-amd64/../macosx-amd64-fastdebug/tmp/deploy/jre-image" >> ../../make/ant/workspace-generated.properties
        echo "ws.output.bundles=/HUDSON/workspace/REtestA-2-build-macosx-amd64-product/REtestA/build/macosx-amd64/../macosx-amd64-fastdebug/bundles" >> ../../make/ant/workspace-generated.properties
        echo "ws.output.generated.root=/HUDSON/workspace/REtestA-2-build-macosx-amd64-product/REtestA/build/macosx-amd64/../macosx-amd64-fastdebug/tmp/deploy" >> ../../make/ant/workspace-generated.properties
        echo "ws.output.generated.headers=/HUDSON/workspace/REtestA-2-build-macosx-amd64-product/REtestA/build/macosx-amd64/../macosx-amd64-fastdebug/tmp/deploy/headers" >> ../../make/ant/workspace-generated.properties
        echo "ws.output.lib.dir=/HUDSON/workspace/REtestA-2-build-macosx-amd64-product/REtestA/build/macosx-amd64/../macosx-amd64-fastdebug/tmp/deploy/jre-image/lib/deploy" >> ../../make/ant/workspace-generated.properties
        echo "ws.source.demo=/HUDSON/workspace/REtestA-2-build-macosx-amd64-product/REtestA/build/macosx-amd64/../macosx-amd64-fastdebug/demo" >> ../../make/ant/workspace-generated.properties
        echo "ws.source.common.shared=src/common/share/classes" >> ../../make/ant/workspace-generated.properties
        echo "ws.source.common.platform=src/common/macosx/classes" >> ../../make/ant/workspace-generated.properties
        echo "ws.source.javaws.shared=src/javaws/share/classes" >> ../../make/ant/workspace-generated.properties
        echo "ws.source.javaws.platform=src/javaws/macosx/classes" >> ../../make/ant/workspace-generated.properties
        echo "ws.source.plugin.shared=src/plugin/share" >> ../../make/ant/workspace-generated.properties
        echo "ws.source.plugin.platform=src/plugin/macosx" >> ../../make/ant/workspace-generated.properties
        echo "ws.test.shared=test/shared" >> ../../make/ant/workspace-generated.properties
        echo "ws.test.platform=test/platform/macosx" >> ../../make/ant/workspace-generated.properties
        echo "ws.test.common=test/common" >> ../../make/ant/workspace-generated.properties
        echo "ws.test.javaws=test/javaws" >> ../../make/ant/workspace-generated.properties
        echo "ws.test.plugin=test/plugin" >> ../../make/ant/workspace-generated.properties
        echo "ws.test.dir.junit=/localtools/share/junit/latest" >> ../../make/ant/workspace-generated.properties
        echo "ws.test.dir.cobertura=" >> ../../make/ant/workspace-generated.properties
        echo "ws.test.dir.reports=/HUDSON/workspace/REtestA-2-build-macosx-amd64-product/REtestA/build/macosx-amd64/../macosx-amd64-fastdebug/tmp/deploy/testreports" >> ../../make/ant/workspace-generated.properties
        echo "ws.test.dir.tmp=/HUDSON/workspace/REtestA-2-build-macosx-amd64-product/REtestA/build/macosx-amd64/../macosx-amd64-fastdebug/tmp" >> ../../make/ant/workspace-generated.properties
        echo "ws.copyright.year=2012" >> ../../make/ant/workspace-generated.properties
        echo "ws.jdk.release=1.7.0_04-ea-fastdebug" >> ../../make/ant/workspace-generated.properties
        echo "ws.release=10.0.0.225" >> ../../make/ant/workspace-generated.properties
        echo "ws.security.baseline.131=1.3.1_21" >> ../../make/ant/workspace-generated.properties
        echo "ws.security.baseline.142=1.4.2_34" >> ../../make/ant/workspace-generated.properties
        echo "ws.security.baseline.150=1.5.0_32" >> ../../make/ant/workspace-generated.properties
        echo "ws.security.baseline.160=1.6.0_29" >> ../../make/ant/workspace-generated.properties
        echo "ws.security.baseline.170=1.7.0_01" >> ../../make/ant/workspace-generated.properties
        echo "ws.security.baseline.180=1.8.0" >> ../../make/ant/workspace-generated.properties
        echo "ws.version.jdk.major=1" >> ../../make/ant/workspace-generated.properties
        echo "ws.version.jdk.minor=7" >> ../../make/ant/workspace-generated.properties
        echo "ws.version.jdk.micro=0" >> ../../make/ant/workspace-generated.properties
        echo "ws.version.major=10" >> ../../make/ant/workspace-generated.properties
        echo "ws.version.minor=0" >> ../../make/ant/workspace-generated.properties
        echo "ws.version.micro=0" >> ../../make/ant/workspace-generated.properties
        echo "ws.version.deploy=10.0.0.225" >> ../../make/ant/workspace-generated.properties
        echo "ws.version.deploy.nodot=1000" >> ../../make/ant/workspace-generated.properties
        echo "ws.version.cab=" >> ../../make/ant/workspace-generated.properties
        echo "ws.version.full=1.7.0_04-ea-fastdebug-b225" >> ../../make/ant/workspace-generated.properties
        echo 'ws.version.jdk="1.7.0_04"' >> ../../make/ant/workspace-generated.properties
        echo "ws.version.jdk.noquote=1.7.0_04" >> ../../make/ant/workspace-generated.properties
        echo "ws.version.jdk.nodot=170" >> ../../make/ant/workspace-generated.properties
        echo "ws.version.clsid_char=" >> ../../make/ant/workspace-generated.properties
        echo "ws.version.build_number=" >> ../../make/ant/workspace-generated.properties
        echo "ws.version.update=04" >> ../../make/ant/workspace-generated.properties
        echo "ws.version.plugin_update=" >> ../../make/ant/workspace-generated.properties
        echo "ws.version.mimetype=1.7.0" >> ../../make/ant/workspace-generated.properties
        echo "ws.version.plugin_cab=" >> ../../make/ant/workspace-generated.properties
        echo 'ws.javaws.namestring="Java(TM) Web Start 10.0.0.225-ea"' >> ../../make/ant/workspace-generated.properties
        echo "ws.javaws.javadoc.windowtitle="JNLP API Reference 1.7.0_04-ea-fastdebug"" >> ../../make/ant/workspace-generated.properties
        echo "ws.javaws.javadoc.doctitle="JNLP API Reference 1.7.0_04-ea-fastdebug"" >> ../../make/ant/workspace-generated.properties
        echo "ws.javaws.javadoc.bundle=jnlp-7u4-ea-doc-b225-13_jan_2012.zip" >> ../../make/ant/workspace-generated.properties
        /usr/bin/printf "%s=%s\n" "ws.javaws.javadoc.copyrightline" '<font size="-1"> Copyright &#x00a9; 1998, 2012, Oracle and/or its affiliates. All rights reserved. </font>' >> ../../make/ant/workspace-generated.properties
        /usr/bin/printf "%s=%s\n" "ws.plugin.javadoc.copyrightline" '<font size="-1"> Copyright &#x00a9; 2007, 2012, Oracle and/or its affiliates. All rights reserved. </font>' >> ../../make/ant/workspace-generated.properties
        echo "ws.image.jre=/HUDSON/workspace/REtestA-2-build-macosx-amd64-product/REtestA/build/macosx-amd64/../macosx-amd64-fastdebug/j2re-image" >> ../../make/ant/workspace-generated.properties
        echo "ws.image.jdk=/HUDSON/workspace/REtestA-2-build-macosx-amd64-product/REtestA/build/macosx-amd64/../macosx-amd64-fastdebug/j2sdk-image" >> ../../make/ant/workspace-generated.properties
        echo "ws.image.demosrc=/HUDSON/workspace/REtestA-2-build-macosx-amd64-product/REtestA/build/macosx-amd64/../macosx-amd64-fastdebug/demo" >> ../../make/ant/workspace-generated.properties
        echo "ws.image.version.mktg=7u4" >> ../../make/ant/workspace-generated.properties
        echo "ws.image.webbundle.name=JavaAppletPlugin.plugin" >> ../../make/ant/workspace-generated.properties
        ANT_OPTS=-Djava.io.tmpdir='/HUDSON/workspace/REtestA-2-build-macosx-amd64-product/REtestA/build/macosx-amd64/../macosx-amd64-fastdebug/tmp' JAVA_HOME='/HUDSON/workspace/REtestA-2-build-macosx-amd64-product/REtestA/build/macosx-amd64/../macosx-amd64-fastdebug/j2sdk-image' /localtools/share/ant/latest/bin/ant -f ../../make/ant/common.build.xml all
        Error: JAVA_HOME is not defined correctly.
          We cannot execute /HUDSON/workspace/REtestA-2-build-macosx-amd64-product/REtestA/build/macosx-amd64/../macosx-amd64-fastdebug/j2sdk-image/bin/java
        gnumake[4]: *** [jars] Error 1
        gnumake[3]: *** [javaws-all] Error 2
        gnumake[2]: *** [deploy-build] Error 2
        gnumake[1]: *** [generic_debug_build] Error 2
        gnumake: *** [build_fastdebug_image] Error 2
        + gmkexitcode=2
        + '[' 2 -ne 0 ']'
        + errorExit 'gnumake failed, return code 2'
        + echo 'ERROR: gnumake failed, return code 2'
        ERROR: gnumake failed, return code 2
        + exit 3
        Notifying upstream projects of job completion
        Finished: FAILURE

          Attachments

            Issue Links

              Activity

                People

                • Assignee:
                  igor Igor Nekrestyanov (Inactive)
                  Reporter:
                  katleman David Katleman
                • Votes:
                  0 Vote for this issue
                  Watchers:
                  1 Start watching this issue

                  Dates

                  • Created:
                    Updated:
                    Resolved:
                    Imported:
                    Indexed: