Uploaded image for project: 'JDK'
  1. JDK
  2. JDK-7180038

regression test failure, SSLEngineBadBufferArrayAccess.java

    Details

    • Subcomponent:
    • Resolved In Build:
      b47
    • CPU:
      generic
    • OS:
      generic
    • Verification:
      Verified

      Backports

        Description

        regression test failed at nightly b45-nightly-2012-06-25:

        #Test Results (version 2)
        #Mon Jun 25 19:29:18 PDT 2012
        #checksum:fbe76f32cf01edf
        #-----testdescription-----
        $file=/export/home/aurora/sandbox/testbase/test/sun/security/ssl/com/sun/net/ssl/internal/ssl/SSLEngineImpl/SSLEngineBadBufferArrayAccess.java
        $root=/export/home/aurora/sandbox/testbase/test
        keywords=bug7031830 othervm
        run=USER_SPECIFIED main/othervm SSLEngineBadBufferArrayAccess SunJSSE does not support dynamic system properties, no way to re-use system properties in samevm/agentvm mode.\n
        source=SSLEngineBadBufferArrayAccess.java
        title=bad_record_mac failure on TLSv1.2 enabled connection with SSLEngine

        #-----environment-----

        #-----testresult-----
        description=file\:/export/home/aurora/sandbox/testbase/test/sun/security/ssl/com/sun/net/ssl/internal/ssl/SSLEngineImpl/SSLEngineBadBufferArrayAccess.java
        elapsed=20787 0\:00\:20.787
        end=Mon Jun 25 19\:29\:18 PDT 2012
        environment=regtest
        execStatus=Failed. Execution failed\: `main' threw exception\: java.lang.Exception\: Client\: Data length error
        hostname=jsn-vw2-00-vm4
        javatestOS=Linux 2.6.32-100.28.5.el6.x86_64 (amd64)
        javatestVersion=4.4
        jtregVersion=jtreg 4.1 fcs b04
        script=com.sun.javatest.regtest.RegressionScript
        sections=script_messages build compile main
        start=Mon Jun 25 19\:28\:58 PDT 2012
        test=sun/security/ssl/com/sun/net/ssl/internal/ssl/SSLEngineImpl/SSLEngineBadBufferArrayAccess.java
        user.name=aurora
        work=/export/home/aurora/sandbox/gresults/testoutput/jdk_security3/JTwork/sun/security/ssl/com/sun/net/ssl/internal/ssl/SSLEngineImpl

        #section:script_messages
        ----------messages:(4/226)----------
        JDK under test: (/export/home/aurora/sandbox/jdk)
        java version "1.8.0-ea"
        Java(TM) SE Runtime Environment (build 1.8.0-ea-langtools-nightly-h263-20120625-b45-b00)
        Java HotSpot(TM) 64-Bit Server VM (build 24.0-b13, mixed mode)

        #section:build
        ----------messages:(3/114)----------
        command: build SSLEngineBadBufferArrayAccess
        reason: Named class compiled on demand
        elapsed time (seconds): 0.142
        result: Passed. Build successful

        #section:compile
        ----------messages:(3/234)----------
        command: compile /export/home/aurora/sandbox/testbase/test/sun/security/ssl/com/sun/net/ssl/internal/ssl/SSLEngineImpl/SSLEngineBadBufferArrayAccess.java
        reason: .class file out of date or does not exist
        elapsed time (seconds): 0.138
        result: Passed. Compilation successful

        #section:main
        ----------messages:(3/376)----------
        command: main SSLEngineBadBufferArrayAccess SunJSSE does not support dynamic system properties, no way to re-use system properties in samevm/agentvm mode.
        reason: User specified action: run main/othervm SSLEngineBadBufferArrayAccess SunJSSE does not support dynamic system properties, no way to re-use system properties in samevm/agentvm mode.
        elapsed time (seconds): 20.644
        ----------System.out:(278/7550)----------
        <skiped>
        Testing TLSv1.1
        ================
        server unwrap: OK/NEED_TASK, 154/0 bytes
        running delegated task...
        new HandshakeStatus: NEED_WRAP
        ----
        server wrap: OK/NEED_UNWRAP, 0/652 bytes
        ================
        server unwrap: OK/NEED_TASK, 75/0 bytes
        running delegated task...
        new HandshakeStatus: NEED_UNWRAP
        ----
        server wrap: OK/NEED_UNWRAP, 0/0 bytes
        ================
        server unwrap: OK/NEED_UNWRAP, 6/0 bytes
        ----
        server wrap: OK/NEED_UNWRAP, 0/0 bytes
        ================
        server unwrap: OK/NEED_WRAP, 69/0 bytes
        ----
        server wrap: OK/NEED_WRAP, 0/6 bytes
        ================
        server unwrap: BUFFER_UNDERFLOW/NEED_WRAP, 0/0 bytes
        ----
        server wrap: OK/FINISHED, 0/69 bytes
        ...ready for application data
        ================
        server unwrap: OK/NOT_HANDSHAKING, 69/26 bytes
        ----
        server wrap: OK/NOT_HANDSHAKING, 29/85 bytes
        ================
        server unwrap: BUFFER_UNDERFLOW/NEED_WRAP, 0/0 bytes
        ----
        server wrap: CLOSED/NEED_UNWRAP, 0/53 bytes
        ================
        server unwrap: CLOSED/NOT_HANDSHAKING, 53/0 bytes
        ----
        server wrap: CLOSED/NOT_HANDSHAKING, 0/0 bytes
        ================
        server unwrap: OK/NEED_TASK, 154/0 bytes
        running delegated task...
        new HandshakeStatus: NEED_WRAP
        ----
        server wrap: OK/NEED_UNWRAP, 0/652 bytes
        ================
        server unwrap: OK/NEED_TASK, 75/0 bytes
        running delegated task...
        new HandshakeStatus: NEED_UNWRAP
        ----
        server wrap: OK/NEED_UNWRAP, 0/0 bytes
        ================
        server unwrap: OK/NEED_UNWRAP, 6/0 bytes
        ----
        server wrap: OK/NEED_UNWRAP, 0/0 bytes
        ================
        server unwrap: OK/NEED_WRAP, 69/0 bytes
        ----
        server wrap: OK/NEED_WRAP, 0/6 bytes
        ================
        server unwrap: BUFFER_UNDERFLOW/NEED_WRAP, 0/0 bytes
        ----
        server wrap: OK/FINISHED, 0/69 bytes
        ...ready for application data
        ================
        server unwrap: OK/NOT_HANDSHAKING, 69/26 bytes
        ----
        server wrap: OK/NOT_HANDSHAKING, 29/85 bytes
        ================
        server unwrap: CLOSED/NEED_WRAP, 53/0 bytes
        ----
        server wrap: CLOSED/NOT_HANDSHAKING, 0/53 bytes
        Testing TLSv1.2
        ================
        server unwrap: OK/NEED_TASK, 198/0 bytes
        running delegated task...
        new HandshakeStatus: NEED_WRAP
        ----
        server wrap: OK/NEED_UNWRAP, 0/653 bytes
        ================
        server unwrap: OK/NEED_TASK, 75/0 bytes
        running delegated task...
        new HandshakeStatus: NEED_UNWRAP
        ----
        server wrap: OK/NEED_UNWRAP, 0/0 bytes
        ================
        server unwrap: OK/NEED_UNWRAP, 6/0 bytes
        ----
        server wrap: OK/NEED_UNWRAP, 0/0 bytes
        ================
        server unwrap: OK/NEED_WRAP, 85/0 bytes
        ----
        server wrap: OK/NEED_WRAP, 0/6 bytes
        ================
        server unwrap: BUFFER_UNDERFLOW/NEED_WRAP, 0/0 bytes
        ----
        server wrap: OK/FINISHED, 0/85 bytes
        ...ready for application data
        ================
        server unwrap: OK/NOT_HANDSHAKING, 85/26 bytes
        ----
        server wrap: OK/NOT_HANDSHAKING, 29/85 bytes
        ================
        server unwrap: BUFFER_UNDERFLOW/NEED_WRAP, 0/0 bytes
        ----
        server wrap: CLOSED/NEED_UNWRAP, 0/69 bytes
        ================
        server unwrap: CLOSED/NOT_HANDSHAKING, 69/0 bytes
        ----
        server wrap: CLOSED/NOT_HANDSHAKING, 0/0 bytes
        ================
        server unwrap: OK/NEED_TASK, 230/0 bytes
        running delegated task...
        new HandshakeStatus: NEED_WRAP
        ----
        server wrap: OK/NEED_WRAP, 0/86 bytes
        ================
        server unwrap: OK/NEED_WRAP, 0/0 bytes
        ----
        server wrap: OK/NEED_WRAP, 0/6 bytes
        ================
        server unwrap: OK/NEED_WRAP, 0/0 bytes
        ----
        server wrap: OK/NEED_UNWRAP, 0/85 bytes
        ================
        server unwrap: OK/NEED_UNWRAP, 6/0 bytes
        ----
        server wrap: OK/NEED_UNWRAP, 0/0 bytes
        ================
        server unwrap: OK/FINISHED, 85/0 bytes
        ...ready for application data
        ----
        server wrap: OK/NOT_HANDSHAKING, 29/85 bytes
        ----------System.err:(14/830)----------
        java.lang.Exception: Client: Data length error
        at SSLEngineBadBufferArrayAccess.runTest(SSLEngineBadBufferArrayAccess.java:296)
        at SSLEngineBadBufferArrayAccess.main(SSLEngineBadBufferArrayAccess.java:156)
        at sun.reflect.NativeMethodAccessorImpl.invoke0(Native Method)
        at sun.reflect.NativeMethodAccessorImpl.invoke(NativeMethodAccessorImpl.java:57)
        at sun.reflect.DelegatingMethodAccessorImpl.invoke(DelegatingMethodAccessorImpl.java:43)
        at java.lang.reflect.Method.invoke(Method.java:474)
        at com.sun.javatest.regtest.MainWrapper$MainThread.run(MainWrapper.java:94)
        at java.lang.Thread.run(Thread.java:722)

        JavaTest Message: Test threw exception: java.lang.Exception: Client: Data length error
        JavaTest Message: shutting down test

        STATUS:Failed.`main' threw exception: java.lang.Exception: Client: Data length error
        result: Failed. Execution failed: `main' threw exception: java.lang.Exception: Client: Data length error

        test result: Failed. Execution failed: `main' threw exception: java.lang.Exception: Client: Data length error

          Attachments

            Issue Links

              Activity

                People

                • Assignee:
                  xuelei Xue-Lei Fan
                  Reporter:
                  xuelei Xue-Lei Fan
                • Votes:
                  0 Vote for this issue
                  Watchers:
                  2 Start watching this issue

                  Dates

                  • Created:
                    Updated:
                    Resolved:
                    Imported:
                    Indexed: