Uploaded image for project: 'JDK'
  1. JDK
  2. JDK-7191928

TEST_BUG: java/awt/Focus/ConsumeNextKeyTypedOnModalShowTest/ConsumeNextKeyTypedOnModalShowTest.java

    Details

    • Subcomponent:
    • Resolved In Build:
      b01
    • CPU:
      generic
    • OS:
      windows_2003
    • Verification:
      Verified

      Description

      Test java/awt/Focus/ConsumeNextKeyTypedOnModalShowTest/ConsumeNextKeyTypedOnModalShowTest.java fails on Windows 2003 x86 and x64 against JDK 6 (all updates).
      Test passes always on Windows 7.

      log:

      #section:main
      ----------messages:(3/158)----------
      command: main ConsumeNextKeyTypedOnModalShowTest
      reason: User specified action: run main ConsumeNextKeyTypedOnModalShowTest
      elapsed time (seconds): 1.453
      ----------System.out:(0/0)----------
      ----------System.err:(14/906)----------
      java.lang.RuntimeException: Test failed: couldn't type a char!
      at ConsumeNextKeyTypedOnModalShowTest.start(ConsumeNextKeyTypedOnModalShowTest.java:106)
      at ConsumeNextKeyTypedOnModalShowTest.main(ConsumeNextKeyTypedOnModalShowTest.java:52)
      at sun.reflect.NativeMethodAccessorImpl.invoke0(Native Method)
      at sun.reflect.NativeMethodAccessorImpl.invoke(NativeMethodAccessorImpl.java:39)
      at sun.reflect.DelegatingMethodAccessorImpl.invoke(DelegatingMethodAccessorImpl.java:25)
      at java.lang.reflect.Method.invoke(Method.java:597)
      at com.sun.javatest.regtest.MainWrapper$MainThread.run(MainWrapper.java:96)
      at java.lang.Thread.run(Thread.java:662)

      JavaTest Message: Test threw exception: java.lang.RuntimeException: Test failed: couldn't type a char!
      JavaTest Message: shutting down test

      STATUS:Failed.`main' threw exception: java.lang.RuntimeException: Test failed: couldn't type a char!
      result: Failed. Execution failed: `main' threw exception: java.lang.RuntimeException: Test failed: couldn't type a char!


      test result: Failed. Execution failed: `main' threw exception: java.lang.RuntimeException: Test failed: couldn't type a char!

        Attachments

          Activity

            People

            • Assignee:
              mcherkas Mikhail Cherkasov (Inactive)
              Reporter:
              kshefov Konstantin Shefov
            • Votes:
              0 Vote for this issue
              Watchers:
              1 Start watching this issue

              Dates

              • Created:
                Updated:
                Resolved:
                Imported:
                Indexed: