Uploaded image for project: 'JDK'
  1. JDK
  2. JDK-7194902

[macosx] closed/java/awt/Button/DoubleActionEventTest/DoubleActionEventTest failed since jdk8b49

    Details

    • Subcomponent:
    • Introduced In Build:
      b49
    • Introduced In Version:
      8
    • Resolved In Build:
      b82
    • CPU:
      x86
    • OS:
      os_x
    • Verification:
      Verified

      Backports

        Description

        test failed with jdk8 since b49 (no macosx bundles for b48, passed with b47) on macosx, works fine on other platforms (checked on linux, solaris amd64), log:
        ----------System.out:(2/90)----------
        Any messages for the tester will display here.
        Wrong number of ActionEvents. Test FAILS.
        ----------System.err:(5/315)----------
        java.lang.RuntimeException: TEST FAILS
        at DoubleActionEventTest.start(DoubleActionEventTest.java:117)
        at com.sun.javatest.regtest.AppletWrapper$AppletRunnable.run(AppletWrapper.java:153)
        at java.lang.Thread.run(Thread.java:722)
        STATUS:Failed.Applet thread threw exception: java.lang.RuntimeException: TEST FAILS
        result: Failed. Execution failed: Applet thread threw exception: java.lang.RuntimeException: TEST FAILS

        see comments for more details

          Attachments

            Issue Links

              Activity

                People

                • Assignee:
                  serb Sergey Bylokhov
                  Reporter:
                  vakulova Vera Akulova (Inactive)
                • Votes:
                  0 Vote for this issue
                  Watchers:
                  2 Start watching this issue

                  Dates

                  • Created:
                    Updated:
                    Resolved:
                    Imported:
                    Indexed: