Uploaded image for project: 'JDK'
  1. JDK
  2. JDK-7195552

lambda-2-build-macosx-amd64 failed with error: unmappable character for encoding US-ASCII

    Details

    • Type: Bug
    • Status: Resolved
    • Priority: P2
    • Resolution: Cannot Reproduce
    • Affects Version/s: 8
    • Fix Version/s: 8-repo-lambda
    • Component/s: tools
    • Labels:
    • Subcomponent:
    • CPU:
      x86
    • OS:
      os_x

      Description

      Lambda build for Macosx fails.
      Inproper use of non-ascii character. However, the file doesn't appear to have changed in the lambda repository, so maybe a build change exposed a latent issue!?


      http://rehudson.sfbay.sun.com:8080/hudson/view/JDK8/view/Nightly/view/lambda/job/lambda-2-build-macosx-amd64-product/104/console


      # Running javac: 157 files; in /HUDSON/workspace/lambda-2-build-macosx-amd64-product/lambda/jdk/make/com/sun/org/apache/xml
      /localtools/macosx-amd64/jdk1.7.0/bin/java -XX:-PrintVMOptions -XX:+UnlockDiagnosticVMOptions -XX:-LogVMOutput -Djava.awt.headless=true -Xmx512m -Xms512m -XX:PermSize=32m -XX:MaxPermSize=160m -Xbootclasspath/p:/HUDSON/workspace/lambda-2-build-macosx-amd64-product/lambda/build/macosx-x86_64/langtools/dist/bootstrap/lib/javac.jar -jar /HUDSON/workspace/lambda-2-build-macosx-amd64-product/lambda/build/macosx-x86_64/langtools/dist/bootstrap/lib/javac.jar -Werror -Xlint:all -Xlint:-path -source 8 -target 8 -encoding ascii -Xbootclasspath:/HUDSON/workspace/lambda-2-build-macosx-amd64-product/lambda/build/macosx-x86_64/classes -sourcepath /HUDSON/workspace/lambda-2-build-macosx-amd64-product/lambda/build/macosx-x86_64/gensrc:::/HUDSON/workspace/lambda-2-build-macosx-amd64-product/lambda/jdk/src/macosx/classes:/HUDSON/workspace/lambda-2-build-macosx-amd64-product/lambda/jdk/src/solaris/classes:/HUDSON/workspace/lambda-2-build-macosx-amd64-product/lambda/jdk/src/share/classes -d /HUDSON/workspace/lambda-2-build-macosx-amd64-product/lambda/build/macosx-x86_64/classes @/HUDSON/workspace/lambda-2-build-macosx-amd64-product/lambda/build/macosx-x86_64/tmp/xml/com.sun.org.apache.xml/.classes.list.filtered
      ../../../../../../src/share/classes/com/sun/org/apache/xml/internal/security/utils/resolver/ResourceResolver.java:146: error: unmappable character for encoding ascii
          * @return clone o? _resolverVector
                           ^
      1 error
      gnumake[7]: *** [.compile.classlist] Error 1
      gnumake[6]: *** [all] Error 1
      gnumake[5]: *** [all] Error 1
      gnumake[4]: *** [all] Error 1
      gnumake[3]: *** [all] Error 1
      gnumake[2]: *** [all] Error 1
      gnumake[1]: *** [jdk-build] Error 2
      gnumake: *** [build_product_image] Error 2
      + gmkexitcode=2
      + '[' 2 -ne 0 ']'
      + errorExit 'gnumake failed, return code 2'
      + echo 'ERROR: gnumake failed, return code 2'
      ERROR: gnumake failed, return code 2
      + exit 3
      Notifying upstream projects of job completion
      Finished: FAILURE

        Attachments

          Activity

            People

            • Assignee:
              vromero Vicente Arturo Romero Zaldivar
              Reporter:
              strarup Peter Jensen (Inactive)
            • Votes:
              0 Vote for this issue
              Watchers:
              2 Start watching this issue

              Dates

              • Created:
                Updated:
                Resolved:
                Imported:
                Indexed: