Uploaded image for project: 'JDK'
  1. JDK
  2. JDK-8010073

Test java/awt/event/KeyEvent/QueueKeyEvent/4799136/Bug4799136.java fails since 5.0 FCS

    XMLWordPrintable

    Details

    • Subcomponent:
    • CPU:
      x86
    • OS:
      solaris_11

      Description

      Testsuite name: Regression
      Test name: java/awt/event/KeyEvent/QueueKeyEvent/4799136/Bug4799136.java
      JDK tested: JDK 5.0u45 b02
      OS tested: Solaris 11 x86
      Is it a regression: No
      Fails on 5.0 FCS: Yes
      Passed against JDK 6u45 on Solaris 11
      Passed against JDK 7u21 on Solaris 11
      Passed on Windows 7 against JDK 5.0u45

      Log:

      #section:main
      ----------messages:(3/108)----------
      command: main Test4799136
      reason: User specified action: run main Test4799136
      elapsed time (seconds): 6.94
      ----------System.out:(13/1121)----------
      Using org.netbeans.jemmy.drivers.DefaultDriverInstaller driver installer
      Using org.netbeans.jemmy.drivers.DefaultDriverInstaller driver installer
      Trace:
      Start to wait frame "Frame with title "Bug4799136"" opened
      Trace:
      Frame "Frame with title "Bug4799136"" has been opened in 0 milliseconds
          Bug4799136[frame0,0,28,760x59,layout=java.awt.BorderLayout,title=Bug4799136,resizable,normal,defaultCloseOperation=DISPOSE_ON_CLOSE,rootPane=javax.swing.JRootPane[,6,24,748x29,layout=javax.swing.JRootPane$RootLayout,alignmentX=0.0,alignmentY=0.0,border=,flags=16777673,maximumSize=,minimumSize=,preferredSize=],rootPaneCheckingEnabled=true]
      Trace:
      Start to wait action "Wait Any javax.swing.JLabel loaded"
      Trace:
      "Wait Any javax.swing.JLabel loaded" action has been produced in 2 milliseconds with result
          : javax.swing.JLabel[,703,7,40x15,alignmentX=0.0,alignmentY=0.0,border=,flags=8388608,maximumSize=,minimumSize=,preferredSize=,defaultIcon=,disabledIcon=,horizontalAlignment=LEADING,horizontalTextPosition=TRAILING,iconTextGap=4,labelFor=,text=Failed,verticalAlignment=CENTER,verticalTextPosition=CENTER]
      Test Failed
      ----------System.err:(13/672)----------
      java.lang.RuntimeException: Failed
      at Test4799136.main(Test4799136.java:47)
      at sun.reflect.NativeMethodAccessorImpl.invoke0(Native Method)
      at sun.reflect.NativeMethodAccessorImpl.invoke(NativeMethodAccessorImpl.java:39)
      at sun.reflect.DelegatingMethodAccessorImpl.invoke(DelegatingMethodAccessorImpl.java:25)
      at java.lang.reflect.Method.invoke(Method.java:592)
      at com.sun.javatest.regtest.MainWrapper$MainThread.run(MainWrapper.java:94)
      at java.lang.Thread.run(Thread.java:637)

      JavaTest Message: Test threw exception: java.lang.RuntimeException: Failed
      JavaTest Message: shutting down test

      STATUS:Failed.`main' threw exception: java.lang.RuntimeException: Failed
      result: Failed. Execution failed: `main' threw exception: java.lang.RuntimeException: Failed


      test result: Failed. Execution failed: `main' threw exception: java.lang.RuntimeException: Failed

        Attachments

          Activity

            People

            Assignee:
            vkarnauk Vladislav Karnaukhov
            Reporter:
            kshefov Konstantin Shefov
            Votes:
            0 Vote for this issue
            Watchers:
            3 Start watching this issue

              Dates

              Created:
              Updated:
              Resolved: