Uploaded image for project: 'JDK'
  1. JDK
  2. JDK-8011614

java/awt/dnd/IntraJVMGetDropSuccessTest/IntraJVMGetDropSuccessTest.html failed on linux

    Details

    • Subcomponent:
    • CPU:
      generic
    • OS:
      linux

      Description

      java/awt/dnd/IntraJVMGetDropSuccessTest/IntraJVMGetDropSuccessTest.html failed on linux since jdk5 fcs with the following output:

      ----------System.out:(0/0)----------
      ----------System.err:(10/658)----------
      java.lang.RuntimeException: Drop not finished
      at IntraJVMGetDropSuccessTest.test(IntraJVMGetDropSuccessTest.java:213)
      at IntraJVMGetDropSuccessTest.start(IntraJVMGetDropSuccessTest.java:177)
      at com.sun.javatest.regtest.AppletWrapper$AppletRunnable.run(AppletWrapper.java:153)
      at java.lang.Thread.run(Thread.java:637)
      java.lang.RuntimeException: The test failed.
      at IntraJVMGetDropSuccessTest.start(IntraJVMGetDropSuccessTest.java:182)
      at com.sun.javatest.regtest.AppletWrapper$AppletRunnable.run(AppletWrapper.java:153)
      at java.lang.Thread.run(Thread.java:637)
      STATUS:Failed.Applet thread threw exception: java.lang.RuntimeException: The test failed.
      result: Failed. Execution failed: Applet thread threw exception: java.lang.RuntimeException: The test failed.


      test passed on windows and solaris

        Attachments

          Activity

            People

            • Assignee:
              vkarnauk Vladislav Karnaukhov
              Reporter:
              vakulova Vera Akulova (Inactive)
            • Votes:
              0 Vote for this issue
              Watchers:
              4 Start watching this issue

              Dates

              • Created:
                Updated:
                Resolved: