Uploaded image for project: 'JDK'
  1. JDK
  2. JDK-8011939

error: cannot find symbol to build microbenchmarks.jar

    Details

    • Type: Bug
    • Status: Resolved
    • Priority: P1
    • Resolution: Fixed
    • Affects Version/s: None
    • Fix Version/s: None
    • Component/s: performance
    • Subcomponent:
    • Introduced In Version:
      8

      Description

      [INFO] Building Microbenchmarks (Java 8, Lambda support)
      [INFO] task-segment: [clean, install]
      [INFO] ------------------------------------------------------------------------
      [INFO] [clean:clean {execution: default-clean}]
      [INFO] [resources:resources {execution: default-resources}]
      [WARNING] Using platform encoding (UTF-8 actually) to copy filtered resources, i.e. build is platform dependent!
      [INFO] Copying 1 resource
      [INFO] [compiler:compile {execution: default-compile}]
      [WARNING] File encoding has not been set, using platform encoding UTF-8, i.e. build is platform dependent!
      [INFO] Compiling 71 source files to /root/benchmarks/microbenchmarks/micros-jdk8-lambda/target/classes
      [INFO] -------------------------------------------------------------
      [ERROR] COMPILATION ERROR :
      [INFO] -------------------------------------------------------------
      [ERROR] /root/benchmarks/microbenchmarks/micros-jdk8-lambda/src/main/java/oracle/micro/benchmarks/jsr335/bulk/IntegerDuplicate/BulkBench.java:[16,23] error: cannot find symbol
      [ERROR] package java.util.stream
      /root/benchmarks/microbenchmarks/micros-jdk8-lambda/src/main/java/oracle/micro/benchmarks/jsr335/bulk/IntegerDuplicate/LambdaBench.java:[15,23] error: cannot find symbol
      [INFO] 2 errors
      [INFO] -------------------------------------------------------------
      [INFO] ------------------------------------------------------------------------
      [ERROR] BUILD FAILURE
      [INFO] ------------------------------------------------------------------------
      [INFO] Compilation failure

      /root/benchmarks/microbenchmarks/micros-jdk8-lambda/src/main/java/oracle/micro/benchmarks/jsr335/bulk/IntegerDuplicate/BulkBench.java:[16,23] error: cannot find symbol
       package java.util.stream
      /root/benchmarks/microbenchmarks/micros-jdk8-lambda/src/main/java/oracle/micro/benchmarks/jsr335/bulk/IntegerDuplicate/LambdaBench.java:[15,23] error: cannot find symbol

      [INFO] ------------------------------------------------------------------------
      [INFO] For more information, run Maven with the -e switch
      [INFO] ------------------------------------------------------------------------
      [INFO] Total time: 3 minutes 16 seconds
      [INFO] Finished at: Wed Apr 10 23:37:13 CEST 2013
      [INFO] Final Memory: 48M/637M
      [INFO] ------------------------------------------------------------------------

        Attachments

          Activity

            People

            • Assignee:
              shade Aleksey Shipilev
              Reporter:
              lshikhva Ludmila Shikhvarg (Inactive)
            • Votes:
              0 Vote for this issue
              Watchers:
              2 Start watching this issue

              Dates

              • Created:
                Updated:
                Resolved: