Details

    • Subcomponent:
      2d
    • Resolved In Build:
      b80
    • CPU:
      generic
    • OS:
      linux

      Backports

        Description

        Testsuite name: AWT

        JDK/JRE tested: 1.8.0_b88 (32/64 bits)
        OS/architecture: Ubuntu 12.04 x64
        Reproducible: Always
        Reproducible on machine: aeremeev-ru
        Is it a Regression: No
        Is it a platform specific issue: Yes

        Robot captures a part of screen which differs from set in createScreenCapture on Ubuntu 12.04 if you have more than one screen devices.
        If displays are duplicated, test passes. But if displays are extended, test fails.
        To reproduce use attached test.
        1. Frame0
          0.2 kB
          Andrei Eremeev
        2. Frame1
          0.4 kB
          Andrei Eremeev
        3. TwoScreenCaptureTest.java
          2 kB
          Andrei Eremeev

          Issue Links

            Activity

            Hide
            azvegint Alexander Zvegintsev added a comment -
            After private discussion with Prasanta turns out that is not a coordinates issue.
            As a fix xwd screen capturing code can be replaced with a single XGetImage() call.
            Show
            azvegint Alexander Zvegintsev added a comment - After private discussion with Prasanta turns out that is not a coordinates issue. As a fix xwd screen capturing code can be replaced with a single XGetImage() call.
            Hide
            hgupdate HG Updates added a comment -
            URL: http://hg.openjdk.java.net/jdk9/client/jdk/rev/46894b1937af
            User: azvegint
            Date: 2015-08-11 13:37:13 +0000
            Show
            hgupdate HG Updates added a comment - URL: http://hg.openjdk.java.net/jdk9/client/jdk/rev/46894b1937af User: azvegint Date: 2015-08-11 13:37:13 +0000
            Hide
            skovalev Sergei Kovalev added a comment - - edited
            Moving rule from dup

            RULE closed/sun/java2d/DirectX/D3dTranslucency.java Exception java.lang.Error: Failed: Incorrect color in window: Expected pixel: ffff0000 Pixel found at (...,0): ff000000
            RULE closed/sun/java2d/OpenGL/DrawImageBg.java Exception java.lang.RuntimeException: Failed: Incorrect color for outer pixel
            RULE closed/sun/java2d/OpenGL/XORPaint.java Exception java.lang.RuntimeException: Failed: Incorrect color for background(expected: ffffffff actual: ff000000)
            RULE closed/sun/java2d/doubleBuffering/DDrawD3DClash/DDrawBltTest.java Exception java.lang.Error: Failed: Incorrect color in window
            RULE closed/sun/java2d/OpenGL/XORPaint.java Exception java.lang.RuntimeException: Failed: Incorrect color for solid rect (non-AA)(expected: ff0000ff actual: ffffffff)
            Show
            skovalev Sergei Kovalev added a comment - - edited Moving rule from dup RULE closed/sun/java2d/DirectX/D3dTranslucency.java Exception java.lang.Error: Failed: Incorrect color in window: Expected pixel: ffff0000 Pixel found at (...,0): ff000000 RULE closed/sun/java2d/OpenGL/DrawImageBg.java Exception java.lang.RuntimeException: Failed: Incorrect color for outer pixel RULE closed/sun/java2d/OpenGL/XORPaint.java Exception java.lang.RuntimeException: Failed: Incorrect color for background(expected: ffffffff actual: ff000000) RULE closed/sun/java2d/doubleBuffering/DDrawD3DClash/DDrawBltTest.java Exception java.lang.Error: Failed: Incorrect color in window RULE closed/sun/java2d/OpenGL/XORPaint.java Exception java.lang.RuntimeException: Failed: Incorrect color for solid rect (non-AA)(expected: ff0000ff actual: ffffffff)
            Hide
            hgupdate HG Updates added a comment -
            URL: http://hg.openjdk.java.net/jdk9/jdk9/jdk/rev/46894b1937af
            User: lana
            Date: 2015-09-01 20:27:06 +0000
            Show
            hgupdate HG Updates added a comment - URL: http://hg.openjdk.java.net/jdk9/jdk9/jdk/rev/46894b1937af User: lana Date: 2015-09-01 20:27:06 +0000
            Hide
            kshefov Konstantin Shefov added a comment -
            RULE "sun/java2d/DirectX/OnScreenRenderingResizeTest/OnScreenRenderingResizeTest.java" Exception java.lang.RuntimeException: Test failed at ...-0 rgb=...
            Show
            kshefov Konstantin Shefov added a comment - RULE "sun/java2d/DirectX/OnScreenRenderingResizeTest/OnScreenRenderingResizeTest.java" Exception java.lang.RuntimeException: Test failed at ...-0 rgb=...

              People

              • Assignee:
                azvegint Alexander Zvegintsev
                Reporter:
                aeremeev Andrei Eremeev
              • Votes:
                0 Vote for this issue
                Watchers:
                9 Start watching this issue

                Dates

                • Created:
                  Updated:
                  Resolved: