Uploaded image for project: 'JDK'
  1. JDK
  2. JDK-8016563

Test closed/java/awt/dnd/ImageTransferTest/ImageTransferTest.html fails

    Details

    • Subcomponent:
    • Resolved In Build:
      b112
    • CPU:
      generic
    • OS:
      windows_7

      Description

      Testuite name: Regression
      Test name: closed/java/awt/dnd/ImageTransferTest/ImageTransferTest.html
      JDK tested: 8 b93
      OS tested: Windows 7 x86, Windows Vista

      Test fails against JDK all builds:

      #section:applet
      ----------messages:(3/146)----------
      command: applet ImageTransferTest.html
      reason: User specified action: run applet/othervm ImageTransferTest.html
      elapsed time (seconds): 62.78
      ----------System.out:(0/0)----------
      ----------System.err:(27/1108)----------
      Applet lost clipboard ownership
      Starting drag...
      Drop was successful=false
      Drop was successful=false
      Drop was successful=false
      Drop was successful=true
      Drop was successful=true
      ========= Child VM System.err ========
      getTransferData was successful
      getTransferData returned null
      format failed: PNG
      getTransferData was successful
      getTransferData returned null
      format failed: JFIF
      getTransferData was successful
      getTransferData returned null
      format failed: DIB
      getTransferData was successful
      format passed: ENHMETAFILE
      getTransferData was successful
      format passed: METAFILEPICT
      ======================================
      java.lang.RuntimeException: test failed: images in following native formats are not transferred properly: PNG JFIF DIB
      at ImageTransferTest.start(ImageTransferTest.java:153)
      at com.sun.javatest.regtest.AppletWrapper$AppletRunnable.run(AppletWrapper.java:153)
      at java.lang.Thread.run(Thread.java:724)
      STATUS:Failed.Applet thread threw exception: java.lang.RuntimeException: test failed: images in following native formats are not transferred properly: PNG JFIF DIB
      result: Failed. Execution failed: Applet thread threw exception: java.lang.RuntimeException: test failed: images in following native formats are not transferred properly: PNG JFIF DIB


      test result: Failed. Execution failed: Applet thread threw exception: java.lang.RuntimeException: test failed: images in following native formats are not transferred properly: PNG JFIF DIB

        Attachments

          Activity

            People

            • Assignee:
              pchelko Petr Pchelko (Inactive)
              Reporter:
              kshefov Konstantin Shefov
            • Votes:
              0 Vote for this issue
              Watchers:
              3 Start watching this issue

              Dates

              • Created:
                Updated:
                Resolved: